BDBM50489040 CHEMBL2299197
SMILES S=c1oc(cc2ccccc12)-c1ccoc1
InChI Key InChIKey=RTEOBVFHSZHKJY-UHFFFAOYSA-N
Data  1 IC50
  Tab Delimited (TSV)   2D SDfile   Computed 3D by Vconf -m prep SDfile
Find this compound or compounds like it in BindingDB:
Activity Spreadsheet -- Enzyme Inhibition Constant Data from BindingDB
Found 1 hit for monomerid = 50489040
TargetLactoperoxidase(Bos taurus (Bovine))TBA
LigandPNGBDBM50489040(CHEMBL2299197)
Affinity DataIC50:  2.65E+4nM. Assay description: Inhibition of Bos taurus (bovine) milk lactoperoxidase-catalyzed iodination of L-tyrosine substrate by reverse phase HPLC analysis
Ligand InfoPC cidPC sid
In DepthDetails Article