BDBM50489048 CHEMBL2299190
SMILES S=c1oc(cc2ccccc12)-c1cccc2ccccc12
InChI Key InChIKey=WNKFKEOOIZEXNF-UHFFFAOYSA-N
Data  1 IC50
  Tab Delimited (TSV)   2D SDfile   Computed 3D by Vconf -m prep SDfile
Find this compound or compounds like it in BindingDB:
Activity Spreadsheet -- Enzyme Inhibition Constant Data from BindingDB
Found 1 hit for monomerid = 50489048
TargetLactoperoxidase(Bos taurus (Bovine))TBA
LigandPNGBDBM50489048(CHEMBL2299190)
Affinity DataIC50:  5.10E+3nM. Assay description: Inhibition of Bos taurus (bovine) milk lactoperoxidase-catalyzed iodination of L-tyrosine substrate by reverse phase HPLC analysis
Ligand InfoPC cidPC sid
In DepthDetails Article