BDBM50491981 2-PHLOROECKOL
SMILES Oc1cc(O)c(Oc2cc(O)c3Oc4cc(O)cc(O)c4Oc3c2Oc2cc(O)cc(O)c2)c(O)c1
InChI Key InChIKey=WYQMJNVMBAQVFD-UHFFFAOYSA-N
Data  1 KI  2 IC50
  Tab Delimited (TSV)   2D SDfile   Computed 3D by Vconf -m prep SDfile
Find this compound or compounds like it in BindingDB:
Activity Spreadsheet -- Enzyme Inhibition Constant Data from BindingDB
Found 3 hits for monomerid = 50491981
TargetReplicase polyprotein 1ab(Human SARS coronavirus (SARS-CoV) (Severe acute re...)
Korea Research Institute Of Bioscience And Biotechnology
Curated by ChEMBL
LigandPNGBDBM50491981(2-PHLOROECKOL)
Affinity DataKi:  2.40E+4nM. Assay description: Competitive inhibition of C-terminal His6-tagged recombinant SARS coronavirus 3C-like protease trans-cleavage activity expressed in Escherichia coli ...
Ligand InfoPC cidPC sid
In DepthDetails ArticlePubMed
TargetReplicase polyprotein 1ab(Human SARS coronavirus (SARS-CoV) (Severe acute re...)
Korea Research Institute Of Bioscience And Biotechnology
Curated by ChEMBL
LigandPNGBDBM50491981(2-PHLOROECKOL)
Affinity DataIC50:  1.12E+5nM. Assay description: Inhibition of SARS coronavirus 3C-like protease cis-cleavage activity transfected in african green monkey Vero cells using SAVLQSGFRK as substrate af...
Ligand InfoPC cidPC sid
In DepthDetails ArticlePubMed
TargetReplicase polyprotein 1ab(Human SARS coronavirus (SARS-CoV) (Severe acute re...)
Korea Research Institute Of Bioscience And Biotechnology
Curated by ChEMBL
LigandPNGBDBM50491981(2-PHLOROECKOL)
Affinity DataIC50:  1.33E+4nM. Assay description: Inhibition of C-terminal His6-tagged recombinant SARS coronavirus 3C-like protease trans-cleavage activity expressed in Escherichia coli BL21 (DE3) u...
Ligand InfoPC cidPC sid
In DepthDetails ArticlePubMed