BDBM50492144 CHEMBL2397574
SMILES Cn1cc(cn1)-c1cnc2oc3c(nc(=O)n(CCC4CCCO4)c3c2c1)-c1cccnc1
InChI Key InChIKey=FWLGBMIRXNXBIW-UHFFFAOYSA-N
Data  1 IC50
  Tab Delimited (TSV)   2D SDfile   Computed 3D by Vconf -m prep SDfile
Find this compound or compounds like it in BindingDB:
Activity Spreadsheet -- Enzyme Inhibition Constant Data from BindingDB
Found 1 hit for monomerid = 50492144
TargetReverse transcriptase(Human immunodeficiency virus 1)
Boehringer Ingelheim (Canada)
Curated by ChEMBL
LigandPNGBDBM50492144(CHEMBL2397574)
Affinity DataIC50:  12nM. Assay description: Inhibition of HIV1 reverse transcriptase using poly(rA)/oligo(dT)15 as substrate after 60 mins by fluorescence assay
Ligand InfoPC cidPC sid
In DepthDetails ArticlePubMed