BDBM50492156 CHEMBL2397560
SMILES CC[C@H]1C[C@H](CCO1)n1c2c3cc(ccc3oc2c(nc1=O)-c1cnn(C)c1)-c1cnn(C)c1
InChI Key InChIKey=LPQYTOYTUGNTHQ-OALUTQOASA-N
Data  1 IC50
  Tab Delimited (TSV)   2D SDfile   Computed 3D by Vconf -m prep SDfile
Find this compound or compounds like it in BindingDB:
Activity Spreadsheet -- Enzyme Inhibition Constant Data from BindingDB
Found 1 hit for monomerid = 50492156
TargetReverse transcriptase(Human immunodeficiency virus 1)
Boehringer Ingelheim (Canada)
Curated by ChEMBL
LigandPNGBDBM50492156(CHEMBL2397560)
Affinity DataIC50:  2.60nM. Assay description: Inhibition of HIV1 reverse transcriptase using poly(rA)/oligo(dT)15 as substrate after 60 mins by fluorescence assay
Ligand InfoPC cidPC sid
In DepthDetails ArticlePubMed