BDBM50492161 CHEMBL2396665
SMILES CNc1ccc(cn1)-c1nc(=O)n(CCC2CC(C)(C)CO2)c2c3cc(cnc3oc12)-c1cnn(C)c1
InChI Key InChIKey=SRXZTYXSCXTZAL-UHFFFAOYSA-N
Data  1 IC50
  Tab Delimited (TSV)   2D SDfile   Computed 3D by Vconf -m prep SDfile
Find this compound or compounds like it in BindingDB:
Activity Spreadsheet -- Enzyme Inhibition Constant Data from BindingDB
Found 1 hit for monomerid = 50492161
TargetReverse transcriptase(Human immunodeficiency virus 1)
Boehringer Ingelheim (Canada)
Curated by ChEMBL
LigandPNGBDBM50492161(CHEMBL2396665)
Affinity DataIC50:  8.20nM. Assay description: Inhibition of HIV1 reverse transcriptase using poly(rA)/oligo(dT)15 as substrate after 60 mins by fluorescence assay
Ligand InfoPC cidPC sid
In DepthDetails ArticlePubMed