BDBM50492173 CHEMBL2397573
SMILES CNc1ccc(nc1)-c1nc(=O)n(CCC2CCCO2)c2c3cc(cnc3oc12)-c1cnn(C)c1
InChI Key InChIKey=NLSDACBTLSVVEY-UHFFFAOYSA-N
Data  1 IC50
  Tab Delimited (TSV)   2D SDfile   Computed 3D by Vconf -m prep SDfile
Find this compound or compounds like it in BindingDB:
Activity Spreadsheet -- Enzyme Inhibition Constant Data from BindingDB
Found 1 hit for monomerid = 50492173
TargetReverse transcriptase(Human immunodeficiency virus 1)
Boehringer Ingelheim (Canada)
Curated by ChEMBL
LigandPNGBDBM50492173(CHEMBL2397573)
Affinity DataIC50:  5.90nM. Assay description: Inhibition of HIV1 reverse transcriptase using poly(rA)/oligo(dT)15 as substrate after 60 mins by fluorescence assay
Ligand InfoPC cidPC sid
In DepthDetails ArticlePubMed