BDBM50492471 CHEMBL2402764
SMILES COc1ccc(CC(=O)Nc2nnc(s2)S(N)(=O)=O)cc1
InChI Key InChIKey=DFEXODLDSRVQHQ-UHFFFAOYSA-N
Data  6 KI
  Tab Delimited (TSV)   2D SDfile   Computed 3D by Vconf -m prep SDfile
Find this compound or compounds like it in BindingDB:
Activity Spreadsheet -- Enzyme Inhibition Constant Data from BindingDB
Found 6 hits for monomerid = 50492471
TargetCarbonic anhydrase 9(Homo sapiens (Human))
Bezmialem Vakif University
Curated by ChEMBL
LigandPNGBDBM50492471(CHEMBL2402764)
Affinity DataKi:  0.310nM. Assay description: Inhibition of human recombinant carbonic anhydrase 9 preincubated for 10 mins by CO2 hydration stopped-flow assay
Ligand InfoPC cidPC sid
In DepthDetails ArticlePubMed
TargetCarbonic anhydrase 12(Homo sapiens (Human))
Bezmialem Vakif University
Curated by ChEMBL
LigandPNGBDBM50492471(CHEMBL2402764)
Affinity DataKi:  0.630nM. Assay description: Inhibition of human recombinant carbonic anhydrase 12 preincubated for 10 mins by CO2 hydration stopped-flow assay
Ligand InfoPC cidPC sid
In DepthDetails ArticlePubMed
TargetCarbonic anhydrase 2(Homo sapiens (Human))
Istanbul University
Curated by ChEMBL
LigandPNGBDBM50492471(CHEMBL2402764)
Affinity DataKi:  0.760nM. Assay description: Inhibition of human carbonic anhydrase 2 preincubated for 15 mins to 6 hrs by CO2 hydration stopped-flow assay
Ligand InfoPC cidPC sid
In DepthDetails ArticlePubMed
TargetCarbonic anhydrase 2(Homo sapiens (Human))
Istanbul University
Curated by ChEMBL
LigandPNGBDBM50492471(CHEMBL2402764)
Affinity DataKi:  0.760nM. Assay description: Inhibition of human recombinant carbonic anhydrase 2 preincubated for 10 mins by CO2 hydration stopped-flow assay
Ligand InfoPC cidPC sid
In DepthDetails ArticlePubMed
TargetCarbonic anhydrase 1(Homo sapiens (Human))
Istanbul University
Curated by ChEMBL
LigandPNGBDBM50492471(CHEMBL2402764)
Affinity DataKi:  2.90nM. Assay description: Inhibition of human carbonic anhydrase 1 preincubated for 15 mins to 6 hrs by CO2 hydration stopped-flow assay
Ligand InfoPC cidPC sid
In DepthDetails ArticlePubMed
TargetCarbonic anhydrase 1(Homo sapiens (Human))
Istanbul University
Curated by ChEMBL
LigandPNGBDBM50492471(CHEMBL2402764)
Affinity DataKi:  2.90nM. Assay description: Inhibition of human recombinant carbonic anhydrase 1 preincubated for 10 mins by CO2 hydration stopped-flow assay
Ligand InfoPC cidPC sid
In DepthDetails ArticlePubMed