BDBM50492474 CHEMBL2402753
SMILES NS(=O)(=O)c1ccc(NC(=O)Cc2ccccc2Br)c(Br)c1
InChI Key InChIKey=IMNAZTLPVPEWJW-UHFFFAOYSA-N
Data  6 KI
  Tab Delimited (TSV)   2D SDfile   Computed 3D by Vconf -m prep SDfile
Find this compound or compounds like it in BindingDB:
Activity Spreadsheet -- Enzyme Inhibition Constant Data from BindingDB
Found 6 hits for monomerid = 50492474
TargetCarbonic anhydrase 9(Homo sapiens (Human))
Bezmialem Vakif University
Curated by ChEMBL
LigandPNGBDBM50492474(CHEMBL2402753)
Affinity DataKi:  0.520nM. Assay description: Inhibition of human recombinant carbonic anhydrase 9 preincubated for 10 mins by CO2 hydration stopped-flow assay
Ligand InfoPC cidPC sid
In DepthDetails ArticlePubMed
TargetCarbonic anhydrase 2(Homo sapiens (Human))
Istanbul University
Curated by ChEMBL
LigandPNGBDBM50492474(CHEMBL2402753)
Affinity DataKi:  0.800nM. Assay description: Inhibition of human carbonic anhydrase 2 preincubated for 15 mins to 6 hrs by CO2 hydration stopped-flow assay
Ligand InfoPC cidPC sid
In DepthDetails ArticlePubMed
TargetCarbonic anhydrase 2(Homo sapiens (Human))
Istanbul University
Curated by ChEMBL
LigandPNGBDBM50492474(CHEMBL2402753)
Affinity DataKi:  0.800nM. Assay description: Inhibition of human recombinant carbonic anhydrase 2 preincubated for 10 mins by CO2 hydration stopped-flow assay
Ligand InfoPC cidPC sid
In DepthDetails ArticlePubMed
TargetCarbonic anhydrase 12(Homo sapiens (Human))
Bezmialem Vakif University
Curated by ChEMBL
LigandPNGBDBM50492474(CHEMBL2402753)
Affinity DataKi:  0.910nM. Assay description: Inhibition of human recombinant carbonic anhydrase 12 preincubated for 10 mins by CO2 hydration stopped-flow assay
Ligand InfoPC cidPC sid
In DepthDetails ArticlePubMed
TargetCarbonic anhydrase 1(Homo sapiens (Human))
Bezmialem Vakif University
Curated by ChEMBL
LigandPNGBDBM50492474(CHEMBL2402753)
Affinity DataKi:  6.5nM. Assay description: Inhibition of human recombinant carbonic anhydrase 1 preincubated for 10 mins by CO2 hydration stopped-flow assay
Ligand InfoPC cidPC sid
In DepthDetails ArticlePubMed
TargetCarbonic anhydrase 1(Homo sapiens (Human))
Bezmialem Vakif University
Curated by ChEMBL
LigandPNGBDBM50492474(CHEMBL2402753)
Affinity DataKi:  6.5nM. Assay description: Inhibition of human carbonic anhydrase 1 preincubated for 15 mins to 6 hrs by CO2 hydration stopped-flow assay
Ligand InfoPC cidPC sid
In DepthDetails ArticlePubMed