BDBM50493148 CHEMBL2419137
SMILES CCCCn1c(\N=C\c2ccc(Br)cc2)c(sc1=S)C#N
InChI Key InChIKey=CVBGOEHIBKQORG-VCHYOVAHSA-N
Data  2 KI
  Tab Delimited (TSV)   2D SDfile   Computed 3D by Vconf -m prep SDfile
Find this compound or compounds like it in BindingDB:
Activity Spreadsheet -- Enzyme Inhibition Constant Data from BindingDB
Found 2 hits for monomerid = 50493148
TargetAdenosine receptor A1(Homo sapiens (Human))
University Of Delhi
Curated by ChEMBL
LigandPNGBDBM50493148(CHEMBL2419137)
Affinity DataKi:  0.100nM. Assay description: Displacement of [3H]DPCPX from human A1 receptor expressed in HEK293 cell membranes after 60 mins by scintillation counting
Ligand InfoPC cidPC sid
In DepthDetails ArticlePubMed
TargetAdenosine receptor A2a(Homo sapiens (Human))
University Of Delhi
Curated by ChEMBL
LigandPNGBDBM50493148(CHEMBL2419137)
Affinity DataKi:  7.60nM. Assay description: Displacement of [3H]ZM241385 from human A2A receptor expressed in HEK293 cell membranes after 60 mins by scintillation counting
Ligand InfoPC cidPC sid
In DepthDetails ArticlePubMed