BDBM50493150 CHEMBL2419140
SMILES Clc1ccc(\C=N\c2c(sc(=S)n2-c2ccccc2)C#N)cc1
InChI Key InChIKey=YVJLBWNXURQJDZ-RGVLZGJSSA-N
Data  2 KI
  Tab Delimited (TSV)   2D SDfile   Computed 3D by Vconf -m prep SDfile
Find this compound or compounds like it in BindingDB:
Activity Spreadsheet -- Enzyme Inhibition Constant Data from BindingDB
Found 2 hits for monomerid = 50493150
TargetAdenosine receptor A2a(Homo sapiens (Human))
University Of Delhi
Curated by ChEMBL
LigandPNGBDBM50493150(CHEMBL2419140)
Affinity DataKi:  0.140nM. Assay description: Displacement of [3H]ZM241385 from human A2A receptor expressed in HEK293 cell membranes after 60 mins by scintillation counting
Ligand InfoPC cidPC sid
In DepthDetails ArticlePubMed
TargetAdenosine receptor A1(Homo sapiens (Human))
University Of Delhi
Curated by ChEMBL
LigandPNGBDBM50493150(CHEMBL2419140)
Affinity DataKi:  413nM. Assay description: Displacement of [3H]DPCPX from human A1 receptor expressed in HEK293 cell membranes after 60 mins by scintillation counting
Ligand InfoPC cidPC sid
In DepthDetails ArticlePubMed