BDBM50493309 CYCLOPENTYLBUTANEPHARINE
SMILES CCC(NC1CCCC1)C(O)c1ccc(O)c(O)c1
InChI Key InChIKey=FEYMRICSONQYOT-UHFFFAOYSA-N
Data  1 Kd
  Tab Delimited (TSV)   2D SDfile   Computed 3D by Vconf -m prep SDfile
Find this compound or compounds like it in BindingDB:
Activity Spreadsheet -- Enzyme Inhibition Constant Data from BindingDB
Found 1 hit for monomerid = 50493309
TargetBeta-2 adrenergic receptor(Homo sapiens (Human))
Medical University Of South Carolina
Curated by ChEMBL
LigandPNGBDBM50493309(CYCLOPENTYLBUTANEPHARINE)
Affinity DataKd:  10nM. Assay description: Binding affinity to beta-2 adrenergic receptor (unknown origin) at 1 to 10000 nM
Ligand InfoPC cidPC sid
In DepthDetails ArticlePubMed