BDBM50493818 Oliceridine::TRV-130::US11124523, Comparative Compound 1::US11484525, Compound TRV-130
SMILES COc1ccsc1CNCC[C@]1(CCOC2(CCCC2)C1)c1ccccn1
InChI Key InChIKey=DMNOVGJWPASQDL-OAQYLSRUSA-N
Data  3 KI  14 IC50  11 EC50
PDB links: 1 PDB ID matches this monomer.
  Tab Delimited (TSV)   2D SDfile   Computed 3D by Vconf -m prep SDfile
Find this compound or compounds like it in BindingDB:
Activity Spreadsheet -- Enzyme Inhibition Constant Data from BindingDB
Found 28 hits for monomerid = 50493818
TargetMu-type opioid receptor(Homo sapiens (Human))
Yantai University
Curated by ChEMBL
LigandPNGBDBM50493818(Oliceridine | TRV-130 | US11124523, Comparative Co...)
Affinity DataKi:  1.5nM. Assay description: Displacement of [3H]-Diprenorphine from human mu opiod receptor expressed in CHO cells incubated for 1 hr by competition binding assay
TargetMu-type opioid receptor(Homo sapiens (Human))
Yantai University
Curated by ChEMBL
LigandPNGBDBM50493818(Oliceridine | TRV-130 | US11124523, Comparative Co...)
Affinity DataKi:  6nM. Assay description: Binding affinity to human mu opioid receptor by radio-ligand binding assay
TargetMu-type opioid receptor [N127C](Homo sapiens (Human))
The Regents Of The University Of California
US Patent
LigandPNGBDBM50493818(Oliceridine | TRV-130 | US11124523, Comparative Co...)
Affinity DataKi:  27nM. Assay description: Each compound was initially tested at 20 μM and was incubated with 3H-DPN at a concentration equal to the Kd (0.4 nM) of the radioligand in _...
TargetVoltage-dependent L-type calcium channel subunit alpha-1C(Homo sapiens (Human))
Trevena
Curated by ChEMBL
LigandPNGBDBM50493818(Oliceridine | TRV-130 | US11124523, Comparative Co...)
Affinity DataIC50:  3.60E+4nM. Assay description: Inhibition of human Cav 1.2 ion channel expressed in HEK293 cells by whole-cell patch clamp technique
In DepthDetails ArticlePubMed
TargetMu-type opioid receptor(Homo sapiens (Human))
Yantai University
Curated by ChEMBL
LigandPNGBDBM50493818(Oliceridine | TRV-130 | US11124523, Comparative Co...)
Affinity DataEC50:  8nM. Assay description: Agonist activity at human mu opioid receptor expressed in HEK293 cells assessed as inhibition of forskolin-stimulated cAMP accumulation by fluorescen...
TargetDelta-type opioid receptor(Homo sapiens (Human))
Trevena
Curated by ChEMBL
LigandPNGBDBM50493818(Oliceridine | TRV-130 | US11124523, Comparative Co...)
Affinity DataEC50:  2.80E+3nM. Assay description: Agonist activity at human delta opioid receptor expressed in HEK293 cells assessed as inhibition of forskolin-stimulated cAMP accumulation by fluores...
In DepthDetails ArticlePubMed
TargetMu-type opioid receptor(Homo sapiens (Human))
Yantai University
Curated by ChEMBL
LigandPNGBDBM50493818(Oliceridine | TRV-130 | US11124523, Comparative Co...)
Affinity DataEC50:  50nM. Assay description: Agonist activity at human mu opioid receptor expressed in HEK293 cells assessed as beta-arrestin recruitment by chemiluminescence assay
TargetMu-type opioid receptor(Homo sapiens (Human))
Yantai University
Curated by ChEMBL
LigandPNGBDBM50493818(Oliceridine | TRV-130 | US11124523, Comparative Co...)
Affinity DataEC50:  7.90nM. Assay description: Agonist activity at human mu opioid receptor expressed in HEK293 cells assessed as inhibition of forskolin-stimulated cAMP accumulation by fluorescen...
TargetMu-type opioid receptor(Homo sapiens (Human))
Yantai University
Curated by ChEMBL
LigandPNGBDBM50493818(Oliceridine | TRV-130 | US11124523, Comparative Co...)
Affinity DataEC50:  3nM. Assay description: The experiment was performed using a cAMP detection kit from Cisbio (Cisbio #62AM4PEJ).
TargetCytochrome P450 1A2(Rattus norvegicus)
TBA
US Patent
LigandPNGBDBM50493818(Oliceridine | TRV-130 | US11124523, Comparative Co...)
Affinity DataIC50: >5.00E+4nM. Assay description: To test the inhibitory effects of the compounds of the present disclosure on different isoforms of human cytochrome P450 isoenzymes
In DepthDetails US Patent
TargetCytochrome P450 2C9(Homo sapiens (Human))
TBA
US Patent
LigandPNGBDBM50493818(Oliceridine | TRV-130 | US11124523, Comparative Co...)
Affinity DataIC50: >5.00E+4nM. Assay description: To test the inhibitory effects of the compounds of the present disclosure on different isoforms of human cytochrome P450 isoenzymes
In DepthDetails US Patent
TargetCytochrome P450 2C19(Homo sapiens (Human))
TBA
US Patent
LigandPNGBDBM50493818(Oliceridine | TRV-130 | US11124523, Comparative Co...)
Affinity DataIC50: >5.00E+4nM. Assay description: To test the inhibitory effects of the compounds of the present disclosure on different isoforms of human cytochrome P450 isoenzymes
In DepthDetails US Patent
TargetCytochrome P450 2D6(Homo sapiens (Human))
TBA
US Patent
LigandPNGBDBM50493818(Oliceridine | TRV-130 | US11124523, Comparative Co...)
Affinity DataIC50:  4.60E+3nM. Assay description: To test the inhibitory effects of the compounds of the present disclosure on different isoforms of human cytochrome P450 isoenzymes
In DepthDetails US Patent
TargetCytochrome P450 3A4(Homo sapiens (Human))
TBA
US Patent
LigandPNGBDBM50493818(Oliceridine | TRV-130 | US11124523, Comparative Co...)
Affinity DataIC50:  1.36E+4nM. Assay description: To test the inhibitory effects of the compounds of the present disclosure on different isoforms of human cytochrome P450 isoenzymes
In DepthDetails US Patent
TargetPotassium voltage-gated channel subfamily H member 2(Homo sapiens (Human))
TBA
US Patent
LigandPNGBDBM50493818(Oliceridine | TRV-130 | US11124523, Comparative Co...)
Affinity DataIC50:  5.50E+3nM. Assay description: To test the blocking effects of the compounds of the present disclosure on hERG potassium currents.
In DepthDetails US Patent
TargetMu-type opioid receptor(Homo sapiens (Human))
Yantai University
Curated by ChEMBL
LigandPNGBDBM50493818(Oliceridine | TRV-130 | US11124523, Comparative Co...)
Affinity DataEC50:  1.80nM. Assay description: Agonist activity at mu opioid receptor (unknown origin) assessed as increase in cAMP level incubated for 40 mins by spectrophotometry
TargetCytochrome P450 1A2(Homo sapiens (Human))
Yantai University
Curated by ChEMBL
LigandPNGBDBM50493818(Oliceridine | TRV-130 | US11124523, Comparative Co...)
Affinity DataIC50: >5.00E+4nM. Assay description: Inhibition of CYP1A2 (unknown origin)
In DepthDetails ArticlePubMed
TargetCytochrome P450 2C9(Homo sapiens (Human))
TBA
US Patent
LigandPNGBDBM50493818(Oliceridine | TRV-130 | US11124523, Comparative Co...)
Affinity DataIC50: >5.00E+4nM. Assay description: Inhibition of CYP2C9 (unknown origin)
In DepthDetails ArticlePubMed
TargetCytochrome P450 2C19(Homo sapiens)
Yantai University
Curated by ChEMBL
LigandPNGBDBM50493818(Oliceridine | TRV-130 | US11124523, Comparative Co...)
Affinity DataIC50: >5.00E+4nM. Assay description: Inhibition of CYP2C19 (unknown origin)
In DepthDetails ArticlePubMed
TargetPotassium voltage-gated channel subfamily H member 2(Homo sapiens (Human))
TBA
US Patent
LigandPNGBDBM50493818(Oliceridine | TRV-130 | US11124523, Comparative Co...)
Affinity DataIC50:  5.50E+3nM. Assay description: Inhibition of human ERG expressed in CHO cells at holding potential of -80 mV by whole cell patch clamp assay
In DepthDetails ArticlePubMed
TargetMu-type opioid receptor(Homo sapiens (Human))
Yantai University
Curated by ChEMBL
LigandPNGBDBM50493818(Oliceridine | TRV-130 | US11124523, Comparative Co...)
Affinity DataEC50:  6.70nM. Assay description: Agonist activity at human mu opioid receptor expressed in HEK293 assessed as increase in calcium mobilization incubated for 60 mins by FLIPR assay
TargetDelta-type opioid receptor(Homo sapiens (Human))
Trevena
Curated by ChEMBL
LigandPNGBDBM50493818(Oliceridine | TRV-130 | US11124523, Comparative Co...)
Affinity DataEC50: >1.00E+4nM. Assay description: Agonist activity at human delta opioid receptor expressed in HEK293 assessed as increase in calcium mobilization incubated for 60 mins by FLIPR assay
In DepthDetails ArticlePubMed
TargetKappa-type opioid receptor(Homo sapiens (Human))
Yantai University
Curated by ChEMBL
LigandPNGBDBM50493818(Oliceridine | TRV-130 | US11124523, Comparative Co...)
Affinity DataEC50: >1.00E+4nM. Assay description: Agonist activity at human kappa opioid receptor expressed in HEK293 assessed as increase in calcium mobilization incubated for 60 mins by FLIPR assay
In DepthDetails ArticlePubMed
TargetMu-type opioid receptor(Homo sapiens (Human))
Yantai University
Curated by ChEMBL
LigandPNGBDBM50493818(Oliceridine | TRV-130 | US11124523, Comparative Co...)
Affinity DataEC50:  12nM. Assay description: Agonist activity at mu opioid receptor (unknown origin) assessed as beta arrestin-2 recruitment incubated for 3 days by PathHunter assay
TargetKappa-type opioid receptor(Homo sapiens (Human))
Yantai University
Curated by ChEMBL
LigandPNGBDBM50493818(Oliceridine | TRV-130 | US11124523, Comparative Co...)
Affinity DataEC50:  1.40E+3nM. Assay description: Agonist activity at human kappa opioid receptor expressed in HEK293 cells assessed as inhibition of forskolin-stimulated cAMP accumulation by fluores...
In DepthDetails ArticlePubMed
TargetPotassium voltage-gated channel subfamily H member 2(Homo sapiens (Human))
TBA
US Patent
LigandPNGBDBM50493818(Oliceridine | TRV-130 | US11124523, Comparative Co...)
Affinity DataIC50:  6.20E+3nM. Assay description: Inhibition of human ERG channel expressed in HEK293 cells by whole-cell patch clamp technique
In DepthDetails ArticlePubMed
TargetSodium channel protein type 5 subunit alpha(Homo sapiens (Human))
Trevena
Curated by ChEMBL
LigandPNGBDBM50493818(Oliceridine | TRV-130 | US11124523, Comparative Co...)
Affinity DataIC50:  1.65E+4nM. Assay description: Inhibition of human Nav 1.5 tonic ion channel expressed in HEK293 cells by whole-cell patch clamp technique
In DepthDetails ArticlePubMed
TargetSodium channel protein type 5 subunit alpha(Homo sapiens (Human))
Trevena
Curated by ChEMBL
LigandPNGBDBM50493818(Oliceridine | TRV-130 | US11124523, Comparative Co...)
Affinity DataIC50:  4.70E+3nM. Assay description: Inhibition of human Nav 1.5 phasic ion channel expressed in HEK293 cells by whole-cell patch clamp technique
In DepthDetails ArticlePubMed