BDBM50494549 CHEMBL3093327
SMILES [H][C@@]12C[C@@]3([H])C[C@]([H])(C[C@]3(C1)c1nc3n(C)c(=O)n(C)c(=O)c3[nH]1)C2
InChI Key InChIKey=JNILKZBFDIKTIT-IOOBAMJDSA-N
Data  6 KI
  Tab Delimited (TSV)   2D SDfile   Computed 3D by Vconf -m prep SDfile
Find this compound or compounds like it in BindingDB:
Activity Spreadsheet -- Enzyme Inhibition Constant Data from BindingDB
Found 6 hits for monomerid = 50494549
TargetAdenosine receptor A1(Rattus norvegicus (rat))
University Of Bonn
Curated by ChEMBL
LigandPNGBDBM50494549(CHEMBL3093327)
Affinity DataKi:  0.124nM. Assay description: Binding affinity to rat adenosine A1 receptor
Ligand InfoPC cidPC sid
In DepthDetails ArticlePubMed
TargetAdenosine receptor A1(Homo sapiens (Human))
University Of Bonn
Curated by ChEMBL
LigandPNGBDBM50494549(CHEMBL3093327)
Affinity DataKi:  0.700nM. Assay description: Binding affinity to human adenosine A1 receptor
Ligand InfoPC cidPC sid
In DepthDetails ArticlePubMed
TargetAdenosine receptor A2b(Homo sapiens (Human))
University Of Bonn
Curated by ChEMBL
LigandPNGBDBM50494549(CHEMBL3093327)
Affinity DataKi:  187nM. Assay description: Binding affinity to human adenosine A2B receptor
Ligand InfoPC cidPC sid
In DepthDetails ArticlePubMed
TargetAdenosine receptor A2a(Rattus norvegicus (rat))
University Of Bonn
Curated by ChEMBL
LigandPNGBDBM50494549(CHEMBL3093327)
Affinity DataKi:  552nM. Assay description: Binding affinity to rat adenosine A2A receptor
Ligand InfoPC cidPC sid
In DepthDetails ArticlePubMed
TargetAdenosine receptor A2a(Homo sapiens (Human))
University Of Bonn
Curated by ChEMBL
LigandPNGBDBM50494549(CHEMBL3093327)
Affinity DataKi:  980nM. Assay description: Binding affinity to human adenosine A2A receptor
Ligand InfoPC cidPC sid
In DepthDetails ArticlePubMed
TargetAdenosine receptor A3(Homo sapiens (Human))
University Of Bonn
Curated by ChEMBL
LigandPNGBDBM50494549(CHEMBL3093327)
Affinity DataKi:  2.30E+3nM. Assay description: Binding affinity to human adenosine A3 receptor
Ligand InfoPC cidPC sid
In DepthDetails ArticlePubMed