BDBM50494994 CHEMBL3099526::acs.jmedchem.1c00409_ST.240
SMILES CC1CCN(CC1)S(=O)(=O)c1ccc2N(C)C(=O)C(=O)c2c1
InChI Key InChIKey=VJMHCEGFLYQVFN-UHFFFAOYSA-N
Data  2 IC50
  Tab Delimited (TSV)   2D SDfile   Computed 3D by Vconf -m prep SDfile
Find this compound or compounds like it in BindingDB:
Activity Spreadsheet -- Enzyme Inhibition Constant Data from BindingDB
Found 2 hits for monomerid = 50494994
TargetReplicase polyprotein 1ab(Human SARS coronavirus (SARS-CoV) (Severe acute re...)
Michigan State University
LigandPNGBDBM50494994(CHEMBL3099526 | acs.jmedchem.1c00409_ST.240)
Affinity DataIC50:  1.04E+3nM. Assay description: This is a review article. Please point to the original journal.
Ligand InfoPC cidPC sid
In DepthDetails ArticlePubMed
TargetReplicase polyprotein 1ab(Human SARS coronavirus (SARS-CoV) (Severe acute re...)
Michigan State University
LigandPNGBDBM50494994(CHEMBL3099526 | acs.jmedchem.1c00409_ST.240)
Affinity DataIC50:  1.04E+3nM. Assay description: Inhibition of GST-tagged SARS coronavirus 3C-like protease by FRET assay
Ligand InfoPC cidPC sid
In DepthDetails ArticlePubMed