BDBM50495008 CHEMBL3099545::acs.jmedchem.1c00409_ST.726
SMILES CN1CCN(CC1)S(=O)(=O)c1ccc2N(Cc3ccccc3)C(=O)C(=O)c2c1
InChI Key InChIKey=BRLKIPDBKPIANQ-UHFFFAOYSA-N
Data  2 IC50
  Tab Delimited (TSV)   2D SDfile   Computed 3D by Vconf -m prep SDfile
Find this compound or compounds like it in BindingDB:
Activity Spreadsheet -- Enzyme Inhibition Constant Data from BindingDB
Found 2 hits for monomerid = 50495008
TargetReplicase polyprotein 1ab(Human SARS coronavirus (SARS-CoV) (Severe acute re...)
Michigan State University
LigandPNGBDBM50495008(CHEMBL3099545 | acs.jmedchem.1c00409_ST.726)
Affinity DataIC50:  6.72E+4nM. Assay description: This is a review article. Please point to the original journal.
Ligand InfoPC cidPC sid
In DepthDetails ArticlePubMed
TargetReplicase polyprotein 1ab(Human SARS coronavirus (SARS-CoV) (Severe acute re...)
Michigan State University
LigandPNGBDBM50495008(CHEMBL3099545 | acs.jmedchem.1c00409_ST.726)
Affinity DataIC50:  6.72E+4nM. Assay description: Inhibition of GST-tagged SARS coronavirus 3C-like protease by FRET assay
Ligand InfoPC cidPC sid
In DepthDetails ArticlePubMed