BDBM50495213 CHEMBL3105071
SMILES COc1ccccc1CNC(=O)[C@H](C)NS(=O)(=O)c1ccccc1
InChI Key InChIKey=VXPWJDQRTSEQBX-ZDUSSCGKSA-N
Data  2 IC50
  Tab Delimited (TSV)   2D SDfile   Computed 3D by Vconf -m prep SDfile
Find this compound or compounds like it in BindingDB:
Activity Spreadsheet -- Enzyme Inhibition Constant Data from BindingDB
Found 2 hits for monomerid = 50495213
TargetReplicase polyprotein 1ab(Human SARS coronavirus (SARS-CoV) (Severe acute re...)
University Of Illinois At Chicago
Curated by ChEMBL
LigandPNGBDBM50495213(CHEMBL3105071)
Affinity DataIC50:  2.99E+4nM. Assay description: Inhibition of SARS coronavirus 3C-like protease using 5-FAM-TSATLQSGFRK(QXL520)-NH2 as substrate preincubated for 5 mins followed by substrate additi...
In DepthDetails ArticlePubMed
TargetReplicase polyprotein 1ab(Human SARS coronavirus (SARS-CoV) (Severe acute re...)
University Of Illinois At Chicago
Curated by ChEMBL
LigandPNGBDBM50495213(CHEMBL3105071)
Affinity DataIC50: >2.00E+5nM. Assay description: Inhibition of SARS coronavirus 3C-like protease using 5-FAM-TSATLQSGFRK(QXL520)-NH2 as substrate preincubated for 5 mins followed by substrate additi...
In DepthDetails ArticlePubMed