BDBM50496308 CHEMBL3125714
SMILES [H][C@@]12C[C@]1([H])[C@H]([C@H](O)[C@@H]2O)n1cnc2c(NC3CC3)nc(nc12)C#CCCCC
InChI Key InChIKey=FFXLBWBFFVZMAF-NFIDOXACSA-N
Data  4 KI  1 EC50
  Tab Delimited (TSV)   2D SDfile   Computed 3D by Vconf -m prep SDfile
Find this compound or compounds like it in BindingDB:
Activity Spreadsheet -- Enzyme Inhibition Constant Data from BindingDB
Found 5 hits for monomerid = 50496308
TargetAdenosine receptor A3(Homo sapiens (Human))
Seoul National University
Curated by ChEMBL
LigandPNGBDBM50496308(CHEMBL3125714)
Affinity DataKi:  9.20nM. Assay description: Displacement of [125I]-I-AB-MECA from recombinant human adenosine A3 receptor expressed in CHO cells after 60 mins by gamma counting analysis
Ligand InfoPC cidPC sid
In DepthDetails ArticlePubMed
TargetAdenosine receptor A3(Rattus norvegicus)
Seoul National University
Curated by ChEMBL
LigandPNGBDBM50496308(CHEMBL3125714)
Affinity DataKi:  39nM. Assay description: Displacement of [125I]-I-AB-MECA from rat adenosine A3 receptor expressed in RBL-2H3 cells after 60 mins by gamma counting analysis
Ligand InfoPC cidPC sid
In DepthDetails ArticlePubMed
TargetAdenosine receptor A1(Homo sapiens (Human))
Seoul National University
Curated by ChEMBL
LigandPNGBDBM50496308(CHEMBL3125714)
Affinity DataKi:  2.17E+3nM. Assay description: Displacement of [3H]-R-PIA from recombinant human adenosine A1 receptor expressed in CHO cells after 60 mins by scintillation counting analysis
Ligand InfoPC cidPC sid
In DepthDetails ArticlePubMed
TargetAdenosine receptor A2a(Homo sapiens (Human))
Seoul National University
Curated by ChEMBL
LigandPNGBDBM50496308(CHEMBL3125714)
Affinity DataKi:  2.20E+3nM. Assay description: Displacement of [3H]-CGS21680 from human adenosine A2A receptor expressed in HEK293 cells after 60 mins by scintillation counting analysis
Ligand InfoPC cidPC sid
In DepthDetails ArticlePubMed
TargetAdenosine receptor A3(Homo sapiens (Human))
Seoul National University
Curated by ChEMBL
LigandPNGBDBM50496308(CHEMBL3125714)
Affinity DataEC50:  20nM. Assay description: Partial agonist activity at recombinant human adenosine A3 receptor expressed in CHO cells assessed as stimulation of forskolin-induced intracellular...
Ligand InfoPC cidPC sid
In DepthDetails ArticlePubMed