BDBM50498985 CHEMBL3734786
SMILES CC(C)n1c(C)nc2cnc(Nc3ccnc(n3)N3CC[C@H](O)C(F)(F)C3)cc12
InChI Key InChIKey=SXBQBMPZTKSXKA-HNNXBMFYSA-N
Data  2 KI  2 IC50
  Tab Delimited (TSV)   2D SDfile   Computed 3D by Vconf -m prep SDfile
Find this compound or compounds like it in BindingDB:
Activity Spreadsheet -- Enzyme Inhibition Constant Data from BindingDB
Found 4 hits for monomerid = 50498985
TargetEpidermal growth factor receptor(Homo sapiens (Human))
Argenta Discovery
Curated by ChEMBL
LigandPNGBDBM50498985(CHEMBL3734786)
Affinity DataKi:  9.5nM. Assay description: Inhibition of human EGFR T790M/L858R double mutant using Fl-EEPLYWSFPAKKK-CONH2 as substrate preincubated for 30 mins followed by addition of substra...
Ligand InfoPC cidPC sid
In DepthDetails ArticlePubMed
TargetEpidermal growth factor receptor(Homo sapiens (Human))
Argenta Discovery
Curated by ChEMBL
LigandPNGBDBM50498985(CHEMBL3734786)
Affinity DataKi: >403nM. Assay description: Inhibition of human wild type EGFR using Fl-EEPLYWSFPAKKK-CONH2 as substrate preincubated for 30 mins followed by addition of substrate measured afte...
Ligand InfoPC cidPC sid
In DepthDetails ArticlePubMed
TargetEpidermal growth factor receptor(Homo sapiens (Human))
Argenta Discovery
Curated by ChEMBL
LigandPNGBDBM50498985(CHEMBL3734786)
Affinity DataIC50:  1.04E+3nM. Assay description: Inhibition of EGFR phosphorylation in human NCI-H1975 cells preincubated for 1 hr followed by stimulation with EGF for 8 mins by electrochemiluminesc...
Ligand InfoPC cidPC sid
In DepthDetails ArticlePubMed
TargetEpidermal growth factor receptor(Homo sapiens (Human))
Argenta Discovery
Curated by ChEMBL
LigandPNGBDBM50498985(CHEMBL3734786)
Affinity DataIC50: >1.00E+4nM. Assay description: Inhibition of EGFR phosphorylation in human NCI-H292 cells preincubated for 1 hr followed by stimulation with EGF for 8 mins by electrochemiluminesce...
Ligand InfoPC cidPC sid
In DepthDetails ArticlePubMed