BDBM50499210 CHEMBL3734846
SMILES O[C@H]1CC[C@@H](CC1)n1c(NC(=O)c2cccc(c2)[N+]([O-])=O)nc2cc(F)ccc12
InChI Key InChIKey=XNUPNXHFLPKLRH-KOMQPUFPSA-N
Data  1 KI
  Tab Delimited (TSV)   2D SDfile   Computed 3D by Vconf -m prep SDfile
Find this compound or compounds like it in BindingDB:
Activity Spreadsheet -- Enzyme Inhibition Constant Data from BindingDB
Found 1 hit for monomerid = 50499210
TargetInterleukin-1 receptor-associated kinase 4(Homo sapiens (Human))
Amgen
Curated by ChEMBL
LigandPNGBDBM50499210(CHEMBL3734846)
Affinity DataKi:  6.5nM. Assay description: Inhibition of recombinant full length IRAK-4 (unknown origin) using the biotinylated substrate RRRVTSPARRS by chemiluminescent ELISA
Ligand InfoPC cidPC sid
In DepthDetails ArticlePubMed