BDBM50505619 CHEMBL4584039
SMILES C[C@@H]1O[C@H](CNS(=O)(=O)c2cnn(C)c2)[C@@H](O)[C@H](O)[C@@H]1O
InChI Key InChIKey=GJBCBKZUJOQANO-GWAIUBNMSA-N
Data  2 IC50
  Tab Delimited (TSV)   2D SDfile   Computed 3D by Vconf -m prep SDfile
Find this compound or compounds like it in BindingDB:
Activity Spreadsheet -- Enzyme Inhibition Constant Data from BindingDB
Found 2 hits for monomerid = 50505619
TargetFucose-binding lectin PA-IIL(Pseudomonas aeruginosa)
Helmholtz Institute For Pharmaceutical Research Saarland (Hips)
Curated by ChEMBL
LigandPNGBDBM50505619(CHEMBL4584039)
Affinity DataIC50:  960nM. Assay description: Inhibition of N-(fluorescein-5-yl)-N'-(alpha-L-fucopyranosyl ethylen)thiocarbamide binding to Pseudomonas aeruginosa PA14 LecB incubated for 22 to 24...
Ligand InfoPC cidPC sid
In DepthDetails ArticlePubMed
TargetFucose-binding lectin PA-IIL(Pseudomonas aeruginosa)
Helmholtz Institute For Pharmaceutical Research Saarland (Hips)
Curated by ChEMBL
LigandPNGBDBM50505619(CHEMBL4584039)
Affinity DataIC50:  5.88E+3nM. Assay description: Inhibition of N-(fluorescein-5-yl)-N'-(alpha-L-fucopyranosyl ethylen)thiocarbamide binding to Pseudomonas aeruginosa PAO1 LecB incubated for 22 to 24...
Ligand InfoPC cidPC sid
In DepthDetails ArticlePubMed