BDBM505063 1-({5-[5- (trifluoro- methyl)- 1,2,4-oxa- diazol-3- yl]pyridin- 2-yl} methyl) quinolin- 2(1H)-one::US11066396, Example 460
SMILES FC(F)(F)c1nc(no1)-c1ccc(Cn2c3ccccc3ccc2=O)nc1
InChI Key InChIKey=LPIZPGYQCNNINO-UHFFFAOYSA-N
Data  2 IC50
  Tab Delimited (TSV)   2D SDfile   Computed 3D by Vconf -m prep SDfile
Find this compound or compounds like it in BindingDB:
Activity Spreadsheet -- Enzyme Inhibition Constant Data from BindingDB
Found 2 hits for monomerid = 505063
TargetHistone deacetylase 1(Homo sapiens (Human))
Merck Sharp & Dohme
US Patent
LigandPNGBDBM505063(1-({5-[5- (trifluoro- methyl)- 1,2,4-oxa- diazol-3...)
Affinity DataIC50:  99nM. Assay description: HDAC1 and 6 reagents: FLAG-tagged HDACs 1 and 6 were prepared in-house by protein expression in HEK293F cells followed by anti-FLAG affinity purifica...
Ligand InfoPC cidPC sid
In DepthDetails US Patent
TargetHistone deacetylase 6(Homo sapiens (Human))
Merck Sharp & Dohme
US Patent
LigandPNGBDBM505063(1-({5-[5- (trifluoro- methyl)- 1,2,4-oxa- diazol-3...)
Affinity DataIC50:  4.5nM. Assay description: HDAC1 and 6 reagents: FLAG-tagged HDACs 1 and 6 were prepared in-house by protein expression in HEK293F cells followed by anti-FLAG affinity purifica...
Ligand InfoPC cidPC sid
In DepthDetails US Patent