BDBM50507304 CHEMBL4534859
SMILES O=C(N([C@@H]1CCCNC1)c1nccc2ccccc12)N1CCC(CC1)c1ccccc1
InChI Key InChIKey=FHNAVVLSBMZVLV-HSZRJFAPSA-N
Data  1 KI
  Tab Delimited (TSV)   2D SDfile   Computed 3D by Vconf -m prep SDfile
Find this compound or compounds like it in BindingDB:
Activity Spreadsheet -- Enzyme Inhibition Constant Data from BindingDB
Found 1 hit for monomerid = 50507304
TargetPotassium voltage-gated channel subfamily H member 2(Homo sapiens (Human))
Pfizer
Curated by ChEMBL
LigandPNGBDBM50507304(CHEMBL4534859)
Affinity DataKi:  4.10E+3nM. Assay description: Binding affinity to human ERG by dofetilide fluorescence polarization binding assay
Ligand InfoPC cidPC sid
In DepthDetails ArticlePubMed