BDBM50507535 CHEMBL4570075
SMILES Cc1cccc(c1)-c1cn(Cc2ccc(cc2)-c2cccnc2)nn1
InChI Key InChIKey=JRGLHUFNZUQJNB-UHFFFAOYSA-N
Data  3 IC50
  Tab Delimited (TSV)   2D SDfile   Computed 3D by Vconf -m prep SDfile
Find this compound or compounds like it in BindingDB:
Activity Spreadsheet -- Enzyme Inhibition Constant Data from BindingDB
Found 3 hits for monomerid = 50507535
TargetVascular endothelial growth factor receptor 2(Homo sapiens (Human))
Xi'An Jiaotong University
Curated by ChEMBL
LigandPNGBDBM50507535(CHEMBL4570075)
Affinity DataIC50:  1.30nM. Assay description: Inhibition of VEGFR2 (unknown origin) after 1 hr by ADP-Glo reagent based luminescent assay
Ligand InfoPC cidPC sid
In DepthDetails ArticlePubMed
TargetEphrin type-B receptor 4(Homo sapiens (Human))
Xi'An Jiaotong University
Curated by ChEMBL
LigandPNGBDBM50507535(CHEMBL4570075)
Affinity DataIC50: >1.00E+3nM. Assay description: Inhibition of EPHB4 (unknown origin) after 4 hrs by ADP-Glo reagent based luminescent assay
Ligand InfoPC cidPC sid
In DepthDetails ArticlePubMed
TargetAngiopoietin-1 receptor(Homo sapiens (Human))
Xi'An Jiaotong University
Curated by ChEMBL
LigandPNGBDBM50507535(CHEMBL4570075)
Affinity DataIC50:  0.450nM. Assay description: Inhibition of TIE2 (unknown origin) after 4 hrs by ADP-Glo reagent based luminescent assay
Ligand InfoPC cidPC sid
In DepthDetails ArticlePubMed