BDBM50508341 CHEMBL4580789
SMILES [H][C@@]12Oc3c4c(C[C@@]5([H])N(CC6CC6)CC[C@@]14[C@@]5(O)CC[C@H]2NC(=O)c1ccncc1C1CCCC1)ccc3O
InChI Key InChIKey=JREDGYCNIRJYKG-PTSROERVSA-N
Data  3 KI  1 EC50
  Tab Delimited (TSV)   2D SDfile   Computed 3D by Vconf -m prep SDfile
Find this compound or compounds like it in BindingDB:
Activity Spreadsheet -- Enzyme Inhibition Constant Data from BindingDB
Found 4 hits for monomerid = 50508341
TargetMu-type opioid receptor(MOUSE)
Virginia Commonwealth University
Curated by ChEMBL
LigandPNGBDBM50508341(CHEMBL4580789)
Affinity DataKi:  0.600nM. Assay description: Displacement of [3H]-naloxone from mouse MOR expressed in CHO cell membranes by competitive radioligand binding assay
Ligand InfoPC cidPC sid
In DepthDetails ArticlePubMed
TargetKappa-type opioid receptor(Mus musculus (Mouse))
Virginia Commonwealth University
Curated by ChEMBL
LigandPNGBDBM50508341(CHEMBL4580789)
Affinity DataKi:  8.20nM. Assay description: Displacement of [3H]-diprenorphine from mouse KOR expressed in CHO cell membranes by competitive radioligand binding assay
Ligand InfoPC cidPC sid
In DepthDetails ArticlePubMed
TargetDelta-type opioid receptor(MOUSE)
Virginia Commonwealth University
Curated by ChEMBL
LigandPNGBDBM50508341(CHEMBL4580789)
Affinity DataKi:  34nM. Assay description: Displacement of [3H]-diprenorphine from mouse DOR expressed in CHO cell membranes by competitive radioligand binding assay
Ligand InfoPC cidPC sid
In DepthDetails ArticlePubMed
TargetMu-type opioid receptor(MOUSE)
Virginia Commonwealth University
Curated by ChEMBL
LigandPNGBDBM50508341(CHEMBL4580789)
Affinity DataEC50:  1.90nM. Assay description: Antagonist activity at mouse MOR expressed in CHO cell membranes assessed as inhibition of DAMGO-stimulated [35S]GTPgammaS binding after 90 mins
Ligand InfoPC cidPC sid
In DepthDetails ArticlePubMed