BDBM50508943 CHEMBL4077836
SMILES OC[C@@H]1CCCN1c1cc(Nc2ccc3NC(=O)CCc3c2)n2ncc(C#N)c2n1
InChI Key InChIKey=YMDAAEXPGFOHGX-INIZCTEOSA-N
Data  1 IC50
  Tab Delimited (TSV)   2D SDfile   Computed 3D by Vconf -m prep SDfile
Find this compound or compounds like it in BindingDB:
Activity Spreadsheet -- Enzyme Inhibition Constant Data from BindingDB
Found 1 hit for monomerid = 50508943
TargetB-cell lymphoma 6 protein(Homo sapiens)
Astrazeneca
Curated by ChEMBL
LigandPNGBDBM50508943(CHEMBL4077836)
Affinity DataIC50:  370nM. Assay description: Inhibition of Bcl6 (unknown origin) by TR-FRET assay
Ligand InfoPC cidPC sid
In DepthDetails ArticlePubMed