BDBM50509181 CHEMBL4448870
SMILES Cc1ccc(cc1Cl)-c1cc2c(N[C@H](Cc3ccccc3)P(O)(O)=O)ncnc2s1
InChI Key InChIKey=FHHLLOYGUMAOOP-IBGZPJMESA-N
Data  1 IC50
PDB links: 1 PDB ID matches this monomer.
  Tab Delimited (TSV)   2D SDfile   Computed 3D by Vconf -m prep SDfile
Find this compound or compounds like it in BindingDB:
Activity Spreadsheet -- Enzyme Inhibition Constant Data from BindingDB
Found 1 hit for monomerid = 50509181
TargetFarnesyl pyrophosphate synthase(Homo sapiens (Human))
Mcgill University
Curated by ChEMBL
LigandPNGBDBM50509181(CHEMBL4448870)
Affinity DataIC50:  3.70E+3nM. Assay description: Allosteric inhibition of N-terminal His-tagged human FPPS expressed in Escherichia coli BL21 (DE3) pre-incubated for 10 mins before addition of GPP a...
Ligand InfoPC cidPC sidPDB