BDBM505110 US11066406, Ex. 4
SMILES O=C(Cc1nc2cnc3[nH]ccc3c2n1C1CCC(CC#N)CC1)NCCC#N
InChI Key InChIKey=DZYJQAKCPQYEKD-UHFFFAOYSA-N
Data  4 IC50
  Tab Delimited (TSV)   2D SDfile   Computed 3D by Vconf -m prep SDfile
Find this compound or compounds like it in BindingDB:
Activity Spreadsheet -- Enzyme Inhibition Constant Data from BindingDB
Found 4 hits for monomerid = 505110
TargetTyrosine-protein kinase JAK1 [574-1154](Homo sapiens (Human))
Janssen Pharmaceutica
US Patent
LigandPNGBDBM505110(US11066406, Ex. 4)
Affinity DataIC50:  0.100nM. Assay description: Substrate (NH2-KGGEEEEYFELVKK-CO2), internal standard peptide (NH2-SWGAIETDKEYYTVKD-CO2) and product peptide (for standard curve only) (NH2-KGGEEEEY-...
Ligand InfoPC cidPC sid
In DepthDetails US Patent
TargetNon-receptor tyrosine-protein kinase TYK2 [580-1182](Homo sapiens (Human))
Janssen Pharmaceutica
US Patent
LigandPNGBDBM505110(US11066406, Ex. 4)
Affinity DataIC50:  2.20nM. Assay description: Substrate (NH2-KGGEEEEYFELVKK-CO2), internal standard peptide (NH2-SWGAIETDKEYYTVKD-CO2) and product peptide (for standard curve only) (NH2-KGGEEEEY-...
Ligand InfoPC cidPC sid
In DepthDetails US Patent
TargetTyrosine-protein kinase JAK3 [512-1124](Homo sapiens (Human))
Janssen Pharmaceutica
US Patent
LigandPNGBDBM505110(US11066406, Ex. 4)
Affinity DataIC50:  96.2nM. Assay description: Substrate (NH2-KGGEEEEYFELVKK-CO2), internal standard peptide (NH2-SWGAIETDKEYYTVKD-CO2) and product peptide (for standard curve only) (NH2-KGGEEEEY-...
Ligand InfoPC cidPC sid
In DepthDetails US Patent
TargetTyrosine-protein kinase JAK2 [532-1132](Homo sapiens (Human))
Janssen Pharmaceutica
US Patent
LigandPNGBDBM505110(US11066406, Ex. 4)
Affinity DataIC50:  6.60nM. Assay description: Substrate (NH2-KGGEEEEYFELVKK-CO2), internal standard peptide (NH2-SWGAIETDKEYYTVKD-CO2) and product peptide (for standard curve only) (NH2-KGGEEEEY-...
Ligand InfoPC cidPC sid
In DepthDetails US Patent