BDBM50511358 CHEMBL4472406::US10988478, Example 175
SMILES CC(C)(O)CCN1Cc2cc(NC(=O)c3cnn4cccnc34)c(cc2C1=O)N1CCOCC1
InChI Key InChIKey=SABMBLXWESIUCC-UHFFFAOYSA-N
Data  2 KI  1 IC50
  Tab Delimited (TSV)   2D SDfile   Computed 3D by Vconf -m prep SDfile
Find this compound or compounds like it in BindingDB:
Activity Spreadsheet -- Enzyme Inhibition Constant Data from BindingDB
Found 3 hits for monomerid = 50511358
TargetInterleukin-1 receptor-associated kinase 4(Homo sapiens (Human))
Genentech
Curated by ChEMBL
LigandPNGBDBM50511358(CHEMBL4472406 | US10988478, Example 175)
Affinity DataKi:  2.20nM. Assay description: Inhibition of recombinant full-length N-terminal His6-tagged human IRAK4 expressed in baculovirus expression system using H-KKARFSRFAGSSPSQSSMVAR pep...
Ligand InfoPC cidPC sid
In DepthDetails ArticlePubMed
TargetInterleukin-1 receptor-associated kinase 4(Homo sapiens (Human))
Genentech
Curated by ChEMBL
LigandPNGBDBM50511358(CHEMBL4472406 | US10988478, Example 175)
Affinity DataKi:  2.20nM. Assay description: Kinase activities were assayed using the Transcreener-Fluorecescence polarization platform (BelBrook Labs, Madison, Wis., USA) that measures amounts ...
Ligand InfoPC cidPC sid
In DepthDetails US Patent
TargetInterleukin-1 receptor-associated kinase 4(Homo sapiens (Human))
Genentech
Curated by ChEMBL
LigandPNGBDBM50511358(CHEMBL4472406 | US10988478, Example 175)
Affinity DataIC50:  0.160nM. Assay description: Inhibition of IRAK4 in human whole blood assessed as inhibition of R848-induced IL-6 production preincubated for 90 mins followed by R848 stimulation...
Ligand InfoPC cidPC sid
In DepthDetails ArticlePubMed