BDBM50511609 CHEMBL4548894
SMILES Cn1c2ccc(Nc3nc(ncc3Cl)-n3cccn3)cc2n(CCC(C)(C)O)c1=O
InChI Key InChIKey=RXLWKUXCLVOOHE-UHFFFAOYSA-N
Data  1 IC50
  Tab Delimited (TSV)   2D SDfile   Computed 3D by Vconf -m prep SDfile
Find this compound or compounds like it in BindingDB:
Activity Spreadsheet -- Enzyme Inhibition Constant Data from BindingDB
Found 1 hit for monomerid = 50511609
TargetB-cell lymphoma 6 protein(Homo sapiens)
TBA
Curated by ChEMBL
LigandPNGBDBM50511609(CHEMBL4548894)
Affinity DataIC50:  710nM. Assay description: Inhibition of recombinant His-tagged human BCL6 expressed in Escherichia coli BL21 AI cell incubated for 2 hrs by TR-FRET assay
Ligand InfoPC cidPC sid
In DepthDetails ArticlePubMed