BDBM50511622 CHEMBL4451702
SMILES Cc1cc(C)n(n1)-c1ncc(Cl)c(Nc2ccc3n(C)c(=O)n(CCC(C)(C)O)c3c2)n1
InChI Key InChIKey=UQSUWLFWPLYJIQ-UHFFFAOYSA-N
Data  1 IC50
PDB links: 1 PDB ID matches this monomer.
  Tab Delimited (TSV)   2D SDfile   Computed 3D by Vconf -m prep SDfile
Find this compound or compounds like it in BindingDB:
Activity Spreadsheet -- Enzyme Inhibition Constant Data from BindingDB
Found 1 hit for monomerid = 50511622
TargetB-cell lymphoma 6 protein(Homo sapiens)
TBA
Curated by ChEMBL
LigandPNGBDBM50511622(CHEMBL4451702)
Affinity DataIC50:  260nM. Assay description: Inhibition of recombinant His-tagged human BCL6 expressed in Escherichia coli BL21 AI cell incubated for 2 hrs by TR-FRET assay
Ligand InfoPC cidPC sidPDB