BDBM50511642 CHEMBL4547183
SMILES C[C@H]1C[C@@H](C)CN(C1)c1ncc(Cl)c(Nc2ccc3n(C)c(=O)n(CCC(C)(C)O)c3c2)n1
InChI Key InChIKey=SZOQWJDRAIBTQM-IYBDPMFKSA-N
Data  1 IC50
  Tab Delimited (TSV)   2D SDfile   Computed 3D by Vconf -m prep SDfile
Find this compound or compounds like it in BindingDB:
Activity Spreadsheet -- Enzyme Inhibition Constant Data from BindingDB
Found 1 hit for monomerid = 50511642
TargetB-cell lymphoma 6 protein(Homo sapiens)
TBA
Curated by ChEMBL
LigandPNGBDBM50511642(CHEMBL4547183)
Affinity DataIC50:  760nM. Assay description: Inhibition of recombinant His-tagged human BCL6 expressed in Escherichia coli BL21 AI cell incubated for 2 hrs by TR-FRET assay
Ligand InfoPC cidPC sid
In DepthDetails ArticlePubMed