BDBM50511650 CHEMBL4550911
SMILES CC[C@H](O)Cn1c2cc(Nc3ccnc(Cl)c3C#N)ccc2n(C)c1=O
InChI Key InChIKey=YYQGUWHFXVXQOO-LBPRGKRZSA-N
Data  1 IC50
PDB links: 1 PDB ID matches this monomer.
  Tab Delimited (TSV)   2D SDfile   Computed 3D by Vconf -m prep SDfile
Find this compound or compounds like it in BindingDB:
Activity Spreadsheet -- Enzyme Inhibition Constant Data from BindingDB
Found 1 hit for monomerid = 50511650
TargetB-cell lymphoma 6 protein(Homo sapiens)
TBA
Curated by ChEMBL
LigandPNGBDBM50511650(CHEMBL4550911)
Affinity DataIC50:  4.60E+3nM. Assay description: Inhibition of recombinant His-tagged human BCL6 expressed in Escherichia coli BL21 AI cell incubated for 2 hrs by TR-FRET assay
Ligand InfoPC cidPC sidPDB