BDBM50511923 CHEMBL4463793
SMILES CN(CCN)Cc1c[nH]cc1-c1cccc(NC(=O)C=C)c1
InChI Key InChIKey=HVDMIAFOVVMNJF-UHFFFAOYSA-N
Data  1 KI  8 IC50
PDB links: 1 PDB ID matches this monomer.
  Tab Delimited (TSV)   2D SDfile   Computed 3D by Vconf -m prep SDfile
Find this compound or compounds like it in BindingDB:
Activity Spreadsheet -- Enzyme Inhibition Constant Data from BindingDB
Found 9 hits for monomerid = 50511923
TargetProtein arginine N-methyltransferase 6(Homo sapiens (Human))
Icahn School Of Medicine At Mount Sinai
Curated by ChEMBL
LigandPNGBDBM50511923(CHEMBL4463793)
Affinity DataKi:  16nM. Assay description: Inhibition of human PRMT6 pre-incubated for 1 to 30 mins using [3H]SAM as donor and [3H]methylated biotin-labeled peptide as substrate by scintillati...
TargetProtein arginine N-methyltransferase 8(Homo sapiens (Human))
Icahn School Of Medicine At Mount Sinai
Curated by ChEMBL
LigandPNGBDBM50511923(CHEMBL4463793)
Affinity DataIC50:  110nM. Assay description: Inhibition of human PRMT8 using [3H]SAM as donor and [3H]methylated biotin-labeled peptide as substrate by scintillation proximity assay
In DepthDetails ArticlePubMed
TargetProtein arginine N-methyltransferase 6(Homo sapiens (Human))
Icahn School Of Medicine At Mount Sinai
Curated by ChEMBL
LigandPNGBDBM50511923(CHEMBL4463793)
Affinity DataIC50:  1.30E+3nM. Assay description: Inhibition of Flag-tagged PRMT6 (unknown origin) expressed in HEK293 cells incubated for 20 hrs assessed as reduction in H3R2me2a levels
TargetProtein arginine N-methyltransferase 1(Homo sapiens)
Icahn School Of Medicine At Mount Sinai
Curated by ChEMBL
LigandPNGBDBM50511923(CHEMBL4463793)
Affinity DataIC50:  5.60E+3nM. Assay description: Inhibition of PRMT1 in human MCF7 cells assessed as reduction in H4R3me2a levels incubated for 2 days by fluorescence based assay
In DepthDetails ArticlePubMed
TargetProtein arginine N-methyltransferase 6(Homo sapiens (Human))
Icahn School Of Medicine At Mount Sinai
Curated by ChEMBL
LigandPNGBDBM50511923(CHEMBL4463793)
Affinity DataIC50:  18nM. Assay description: Inhibition of human PRMT6 using [3H]SAM as donor and [3H]methylated biotin-labeled peptide as substrate by scintillation proximity assay
TargetProtein arginine N-methyltransferase 6(Homo sapiens (Human))
Icahn School Of Medicine At Mount Sinai
Curated by ChEMBL
LigandPNGBDBM50511923(CHEMBL4463793)
Affinity DataIC50:  18nM. Assay description: Inhibition of human PRMT6 using [3H]SAM as donor and [3H]methylated biotin-labeled peptide as substrate by scintillation proximity assay
TargetProtein arginine N-methyltransferase 1(Homo sapiens)
Icahn School Of Medicine At Mount Sinai
Curated by ChEMBL
LigandPNGBDBM50511923(CHEMBL4463793)
Affinity DataIC50:  100nM. Assay description: Inhibition of human PRMT1 using [3H]SAM as donor and [3H]methylated biotin-labeled peptide as substrate by scintillation proximity assay
In DepthDetails ArticlePubMed
TargetProtein arginine N-methyltransferase 3(Homo sapiens)
Icahn School Of Medicine At Mount Sinai
Curated by ChEMBL
LigandPNGBDBM50511923(CHEMBL4463793)
Affinity DataIC50:  3.00E+3nM. Assay description: Inhibition of human PRMT3 using [3H]SAM as donor and [3H]methylated biotin-labeled peptide as substrate by scintillation proximity assay
In DepthDetails ArticlePubMed
TargetHistone-arginine methyltransferase CARM1(Homo sapiens (Human))
Icahn School Of Medicine At Mount Sinai
Curated by ChEMBL
LigandPNGBDBM50511923(CHEMBL4463793)
Affinity DataIC50:  480nM. Assay description: Inhibition of human PRMT4 using [3H]SAM as donor and [3H]methylated biotin-labeled peptide as substrate by scintillation proximity assay
In DepthDetails ArticlePubMed