BDBM50512145 CHEMBL4546953
SMILES Clc1ccc(cc1)-n1cc(nn1)-c1cccc(NS(=O)(=O)c2c[nH]c(=O)[nH]c2=O)c1
InChI Key InChIKey=ZVKKHPPAHPDWOL-UHFFFAOYSA-N
Data  1 IC50
  Tab Delimited (TSV)   2D SDfile   Computed 3D by Vconf -m prep SDfile
Find this compound or compounds like it in BindingDB:
Activity Spreadsheet -- Enzyme Inhibition Constant Data from BindingDB
Found 1 hit for monomerid = 50512145
TargetPolyunsaturated fatty acid lipoxygenase ALOX15B(Rattus norvegicus)
China Medical University
Curated by ChEMBL
LigandPNGBDBM50512145(CHEMBL4546953)
Affinity DataIC50:  450nM. Assay description: Inhibition of human thymidylate synthase using dUMP as substrate by spectrophotometric method
Ligand InfoPC cidPC sid
In DepthDetails ArticlePubMed