BDBM50512171 CHEMBL4513689
SMILES CCCCCCCCCc1nc2cc(F)c(F)cc2c(=O)n1N
InChI Key InChIKey=OCAUYEVFPSOXEF-UHFFFAOYSA-N
Data  1 IC50
  Tab Delimited (TSV)   2D SDfile   Computed 3D by Vconf -m prep SDfile
Find this compound or compounds like it in BindingDB:
Activity Spreadsheet -- Enzyme Inhibition Constant Data from BindingDB
Found 1 hit for monomerid = 50512171
TargetVirulence factor transcriptional regulator MvfR(Pseudomonas aeruginosa PA14)
Mashhad University Of Medical Sciences
Curated by ChEMBL
LigandPNGBDBM50512171(CHEMBL4513689)
Affinity DataIC50:  1.20E+3nM. Assay description: Antagonist activity at His6 -tagged Pseudomonas aeruginosa PqsR CBD domain expressed in Escherichia coli Rosetta 2 (DE3)
Ligand InfoPC cidPC sid
In DepthDetails ArticlePubMed