BDBM50513788 CHEMBL4558162
SMILES Cc1ccc2n(c(CCN3C(=O)c4cccc5cccc(C3=O)c45)nc2c1)-c1ccncc1
InChI Key InChIKey=VFDVYUMIEWOVJX-UHFFFAOYSA-N
Data  31 IC50
PDB links: 1 PDB ID matches this monomer.
  Tab Delimited (TSV)   2D SDfile   Computed 3D by Vconf -m prep SDfile
Find this compound or compounds like it in BindingDB:
Activity Spreadsheet -- Enzyme Inhibition Constant Data from BindingDB
Found 31 hits for monomerid = 50513788
TargetHigh affinity cAMP-specific and IBMX-insensitive 3',5'-cyclic phosphodiesterase 8A(Homo sapiens (Human))
Sun Yat-Sen University
Curated by ChEMBL
LigandPNGBDBM50513788(CHEMBL4558162)
Affinity DataIC50: >2.00E+4nM. Assay description: Inhibition of PDE8A1 catalytic domain (480 to 820 residues) (unknown origin) expressed in Escherichia coli BL21 cells
Ligand InfoPC cidPC sidPDB
In DepthDetails ArticlePubMed
TargetHigh affinity cAMP-specific 3',5'-cyclic phosphodiesterase 7A(Homo sapiens (Human))
Sun Yat-Sen University
Curated by ChEMBL
LigandPNGBDBM50513788(CHEMBL4558162)
Affinity DataIC50: >2.00E+4nM. Assay description: Inhibition of PDE7A1 catalytic domain (130 to 482 residues) (unknown origin) expressed in Escherichia coli BL21 cells
Ligand InfoPC cidPC sidPDB
In DepthDetails ArticlePubMed
TargetBromodomain-containing protein 4(Homo sapiens (Human))
Sun Yat-Sen University
Curated by ChEMBL
LigandPNGBDBM50513788(CHEMBL4558162)
Affinity DataIC50: >1.00E+4nM. Assay description: Inhibition of BRD4 (unknown origin)
Ligand InfoPC cidPC sidPDB
In DepthDetails ArticlePubMed
TargetEstrogen receptor(Homo sapiens (Human))
Sun Yat-Sen University
Curated by ChEMBL
LigandPNGBDBM50513788(CHEMBL4558162)
Affinity DataIC50: >2.00E+4nM. Assay description: Inhibition of human Gal4-fused ER alpha expressed in 293FT cells after 24 hrs by luciferase reporter gene assay
Ligand InfoPC cidPC sidPDB
In DepthDetails ArticlePubMed
TargetTyrosine-protein kinase ABL1(Homo sapiens (Human))
Sun Yat-Sen University
Curated by ChEMBL
LigandPNGBDBM50513788(CHEMBL4558162)
Affinity DataIC50: >1.00E+4nM. Assay description: Inhibition of recombinant full-length human His-tagged ABL1 expressed in baculovirus expression system using Tyr2 peptide as substrate after 2 hrs by...
Ligand InfoPC cidPC sidPDB
In DepthDetails ArticlePubMed
TargetHistone deacetylase 6(Homo sapiens (Human))
Sun Yat-Sen University
Curated by ChEMBL
LigandPNGBDBM50513788(CHEMBL4558162)
Affinity DataIC50: >1.00E+4nM. Assay description: Inhibition of recombinant human full length HDAC6 expressed in Sf9 insect cells using acetylated peptide as susbtrate after 60 mins by fluorescence b...
Ligand InfoPC cidPC sidPDB
In DepthDetails ArticlePubMed
TargetAcetylcholinesterase(Electrophorus electricus (Electric eel))
Sun Yat-Sen University
Curated by ChEMBL
LigandPNGBDBM50513788(CHEMBL4558162)
Affinity DataIC50: >2.00E+4nM. Assay description: Inhibition of electric eel AChE using ATC as substrate after 15 mins by Ellman's method
Ligand InfoPC cidPC sidPDB
In DepthDetails ArticlePubMed
TargetCholinesterase(Equus caballus (Horse))
Sun Yat-Sen University
Curated by ChEMBL
LigandPNGBDBM50513788(CHEMBL4558162)
Affinity DataIC50: >2.00E+4nM. Assay description: Inhibition of equine serum BuChE using BTC as substrate after 15 mins by Ellman's method
Ligand InfoPC cidPC sidPDB
In DepthDetails ArticlePubMed
TargetEstrogen receptor beta(Homo sapiens (Human))
Sun Yat-Sen University
Curated by ChEMBL
LigandPNGBDBM50513788(CHEMBL4558162)
Affinity DataIC50: >2.00E+4nM. Assay description: Inhibition of ER beta ((unknown origin))
Ligand InfoPC cidPC sidPDB
In DepthDetails ArticlePubMed
TargetFibroblast growth factor receptor 1(Homo sapiens (Human))
Sun Yat-Sen University
Curated by ChEMBL
LigandPNGBDBM50513788(CHEMBL4558162)
Affinity DataIC50: >1.00E+4nM. Assay description: Inhibition of FGFR1 (unknown origin)
Ligand InfoPC cidPC sidPDB
In DepthDetails ArticlePubMed
TargetReceptor-type tyrosine-protein kinase FLT3(Homo sapiens (Human))
Sun Yat-Sen University
Curated by ChEMBL
LigandPNGBDBM50513788(CHEMBL4558162)
Affinity DataIC50: >1.00E+4nM. Assay description: Inhibition of FLT3 (unknown origin)
Ligand InfoPC cidPC sidPDB
In DepthDetails ArticlePubMed
TargetAurora kinase A(Homo sapiens (Human))
Sun Yat-Sen University
Curated by ChEMBL
LigandPNGBDBM50513788(CHEMBL4558162)
Affinity DataIC50: >1.00E+4nM. Assay description: Inhibition of Aurora A (unknown origin)
Ligand InfoPC cidPC sidPDB
In DepthDetails ArticlePubMed
TargetAurora kinase B(Homo sapiens (Human))
Sun Yat-Sen University
Curated by ChEMBL
LigandPNGBDBM50513788(CHEMBL4558162)
Affinity DataIC50: >1.00E+4nM. Assay description: Inhibition of Aurora B (unknown origin)
Ligand InfoPC cidPC sidPDB
In DepthDetails ArticlePubMed
TargetEpidermal growth factor receptor(Homo sapiens (Human))
Sun Yat-Sen University
Curated by ChEMBL
LigandPNGBDBM50513788(CHEMBL4558162)
Affinity DataIC50: >1.00E+4nM. Assay description: Inhibition of EGFR (unknown origin)
Ligand InfoPC cidPC sidPDB
In DepthDetails ArticlePubMed
TargetMitogen-activated protein kinase kinase kinase 20(Homo sapiens (Human))
Sun Yat-Sen University
Curated by ChEMBL
LigandPNGBDBM50513788(CHEMBL4558162)
Affinity DataIC50: >1.00E+4nM. Assay description: Inhibition of ZAK (unknown origin)
Ligand InfoPC cidPC sidPDB
In DepthDetails ArticlePubMed
LigandPNGBDBM50513788(CHEMBL4558162)
Affinity DataIC50: >2.00E+4nM. Assay description: Inhibition of human N-terminal GST-tagged PDE1C catalytic domain (2 to 634 residues) expressed in baculovirus infected Sf9 cells
Ligand InfoPC cidPC sidPDB
In DepthDetails ArticlePubMed
TargetcGMP-dependent 3',5'-cyclic phosphodiesterase(Homo sapiens (Human))
Sun Yat-Sen University
Curated by ChEMBL
LigandPNGBDBM50513788(CHEMBL4558162)
Affinity DataIC50: >2.00E+4nM. Assay description: Inhibition of PDE2A catalytic domain (580 to 919 residues) (unknown origin) expressed in Escherichia coli BL21 cells
Ligand InfoPC cidPC sidPDB
In DepthDetails ArticlePubMed
TargetcAMP-specific 3',5'-cyclic phosphodiesterase 4D(Homo sapiens (Human))
Sun Yat-Sen University
Curated by ChEMBL
LigandPNGBDBM50513788(CHEMBL4558162)
Affinity DataIC50: >2.00E+4nM. Assay description: Inhibition of human PDE4D2 catalytic domain (86 to 413 residues) expressed in Escherichia coli BL21 cells
Ligand InfoPC cidPC sidPDB
In DepthDetails ArticlePubMed
TargetCone cGMP-specific 3',5'-cyclic phosphodiesterase subunit alpha'(Homo sapiens (Human))
Sun Yat-Sen University
Curated by ChEMBL
LigandPNGBDBM50513788(CHEMBL4558162)
Affinity DataIC50: >2.00E+4nM. Assay description: Inhibition of PDE6C (1 to 858 residues) (unknown origin)
Ligand InfoPC cidPC sidPDB
In DepthDetails ArticlePubMed
TargetcGMP-specific 3',5'-cyclic phosphodiesterase(Homo sapiens (Human))
Sun Yat-Sen University
Curated by ChEMBL
LigandPNGBDBM50513788(CHEMBL4558162)
Affinity DataIC50: >2.00E+4nM. Assay description: Inhibition of PDE5A1 catalytic domain (535 to 860 residues) (unknown origin) expressed in Escherichia coli BL21 cells
Ligand InfoPC cidPC sidPDB
In DepthDetails ArticlePubMed
TargetHistone deacetylase 1(Homo sapiens (Human))
Sun Yat-Sen University
Curated by ChEMBL
LigandPNGBDBM50513788(CHEMBL4558162)
Affinity DataIC50: >1.00E+4nM. Assay description: Inhibition of recombinant human full length C-terminal His/FALG-tagged HDAC1 expressed in Sf9 insect cells using acetylated peptide as susbtrate afte...
Ligand InfoPC cidPC sidPDB
In DepthDetails ArticlePubMed
TargetPotassium voltage-gated channel subfamily H member 2(Homo sapiens (Human))
Sun Yat-Sen University
Curated by ChEMBL
LigandPNGBDBM50513788(CHEMBL4558162)
Affinity DataIC50:  4.70E+3nM. Assay description: Inhibition of human ERG expressd in CHO-hERG cells after 2.5 hrs by Rb+ efflux assay
Ligand InfoPC cidPC sidPDB
In DepthDetails ArticlePubMed
TargetFibroblast growth factor receptor 4(Homo sapiens (Human))
Sun Yat-Sen University
Curated by ChEMBL
LigandPNGBDBM50513788(CHEMBL4558162)
Affinity DataIC50: >1.00E+4nM. Assay description: Inhibition of FGFR4 (unknown origin)
Ligand InfoPC cidPC sidPDB
In DepthDetails ArticlePubMed
TargetSerine/threonine-protein kinase PLK1(Homo sapiens (Human))
Sun Yat-Sen University
Curated by ChEMBL
LigandPNGBDBM50513788(CHEMBL4558162)
Affinity DataIC50: >1.00E+4nM. Assay description: Inhibition of PLK1 (unknown origin)
Ligand InfoPC cidPC sidPDB
In DepthDetails ArticlePubMed
TargetProstaglandin G/H synthase 2(Homo sapiens (Human))
Sun Yat-Sen University
Curated by ChEMBL
LigandPNGBDBM50513788(CHEMBL4558162)
Affinity DataIC50: >1.00E+4nM. Assay description: Inhibition of COX2 (unknown origin)
Ligand InfoPC cidPC sidPDB
In DepthDetails ArticlePubMed
LigandPNGBDBM50513788(CHEMBL4558162)
Affinity DataIC50: >2.00E+4nM. Assay description: Inhibition of PDE1B catalytic domain (10 to 487 residues) (unknown origin) expressed in Escherichia coli BL21 cells
Ligand InfoPC cidPC sidPDB
In DepthDetails ArticlePubMed
TargetcGMP-inhibited 3',5'-cyclic phosphodiesterase 3A(Homo sapiens (Human))
Sun Yat-Sen University
Curated by ChEMBL
LigandPNGBDBM50513788(CHEMBL4558162)
Affinity DataIC50: >2.00E+4nM. Assay description: Inhibition of PDE3A catalytic domain (679 to 1087 residues) (unknown origin) expressed in Escherichia coli BL21 cells
Ligand InfoPC cidPC sidPDB
In DepthDetails ArticlePubMed
TargetHigh affinity cGMP-specific 3',5'-cyclic phosphodiesterase 9A(Homo sapiens (Human))
Sun Yat-Sen University
Curated by ChEMBL
LigandPNGBDBM50513788(CHEMBL4558162)
Affinity DataIC50: >2.00E+4nM. Assay description: Inhibition of PDE9A2 catalytic domain (181 to 506 residues) (unknown origin) expressed in Escherichia coli BL21 cells
Ligand InfoPC cidPC sidPDB
In DepthDetails ArticlePubMed
TargetFibroblast growth factor receptor 2(Homo sapiens (Human))
Sun Yat-Sen University
Curated by ChEMBL
LigandPNGBDBM50513788(CHEMBL4558162)
Affinity DataIC50: >1.00E+4nM. Assay description: Inhibition of FGFR2 (unknown origin)
Ligand InfoPC cidPC sidPDB
In DepthDetails ArticlePubMed
TargetcAMP and cAMP-inhibited cGMP 3',5'-cyclic phosphodiesterase 10A(Homo sapiens (Human))
Sun Yat-Sen University
Curated by ChEMBL
LigandPNGBDBM50513788(CHEMBL4558162)
Affinity DataIC50:  0.440nM. Assay description: Inhibition of human PDE10A2 catalytic domain (446 to 789 residues) expressed in Escherichia coli BL21 cells using [3H]-cGMP as substrate after 15 min...
Ligand InfoPC cidPC sidPDB
TargetFibroblast growth factor receptor 3(Homo sapiens (Human))
Sun Yat-Sen University
Curated by ChEMBL
LigandPNGBDBM50513788(CHEMBL4558162)
Affinity DataIC50: >1.00E+4nM. Assay description: Inhibition of FGFR3 (unknown origin)
Ligand InfoPC cidPC sidPDB
In DepthDetails ArticlePubMed