BDBM50514082 CHEMBL4462811
SMILES NC(=N)c1ccc(CNC(=O)[C@H](CCc2ccncc2)NC(=O)[C@@H](CCCc2ccccc2)NS(=O)(=O)Cc2ccccc2)cc1
InChI Key InChIKey=OUGUMFKJMHXPKT-AJQTZOPKSA-N
Data  2 KI
  Tab Delimited (TSV)   2D SDfile   Computed 3D by Vconf -m prep SDfile
Find this compound or compounds like it in BindingDB:
Activity Spreadsheet -- Enzyme Inhibition Constant Data from BindingDB
Found 2 hits for monomerid = 50514082
TargetPlasminogen(Homo sapiens (Human))
Philipps University Marburg
Curated by ChEMBL
LigandPNGBDBM50514082(CHEMBL4462811)
Affinity DataKi:  0.480nM. Assay description: Inhibition of human plasmin using tosyl-Gly-Pro-Lys-pNA as substrate after 10 mins by UV/Vis photometry
Ligand InfoPC cidPC sid
In DepthDetails ArticlePubMed
TargetPlasma kallikrein(Homo sapiens (Human))
Philipps University Marburg
Curated by ChEMBL
LigandPNGBDBM50514082(CHEMBL4462811)
Affinity DataKi:  0.600nM. Assay description: Inhibition of human plasma kallikrein using S2302 as substrate after 10 mins by UV/Vis photometry
Ligand InfoPC cidPC sid
In DepthDetails ArticlePubMed