BDBM505144 US11066409, Compound I-0188
SMILES CN1C2=NCC(N2C(NCc2ccccc2)=NC1=O)c1cc(F)c(F)c(F)c1
InChI Key InChIKey=IIKHUDONLSKHKE-UHFFFAOYSA-N
Data  1 IC50
  Tab Delimited (TSV)   2D SDfile   Computed 3D by Vconf -m prep SDfile
Find this compound or compounds like it in BindingDB:
Activity Spreadsheet -- Enzyme Inhibition Constant Data from BindingDB
Found 1 hit for monomerid = 505144
TargetP2X purinoceptor 7(Homo sapiens (Human))
Shionogi
US Patent
LigandPNGBDBM505144(US11066409, Compound I-0188)
Affinity DataIC50:  7.60nM. Assay description: Evaluation of a human P2X7 receptor inhibitory activity Stably expressing cell line (1321N1 cell transfected with the human P2X7 receptor gene (GenBa...
Ligand InfoPC cidPC sid
In DepthDetails US Patent