BDBM50514938 CHEMBL4584820::US10988478, Example 60
SMILES CC1(C)Cc2cc(NC(=O)c3cnn4cccnc34)c(cc2O1)N1CCN(CCO)CC1
InChI Key InChIKey=PUCGCLGXRSNVHZ-UHFFFAOYSA-N
Data  2 KI  1 IC50
  Tab Delimited (TSV)   2D SDfile   Computed 3D by Vconf -m prep SDfile
Find this compound or compounds like it in BindingDB:
Activity Spreadsheet -- Enzyme Inhibition Constant Data from BindingDB
Found 3 hits for monomerid = 50514938
TargetInterleukin-1 receptor-associated kinase 4(Homo sapiens (Human))
Genentech
Curated by ChEMBL
LigandPNGBDBM50514938(CHEMBL4584820 | US10988478, Example 60)
Affinity DataKi:  6.60nM. Assay description: Inhibition of human recombinant full length His6-tagged IRAK4 expressed in baculovirus expression system using H-KKARFSRFAGSSPSQSSMVAR as substrate i...
Ligand InfoPC cidPC sid
In DepthDetails ArticlePubMed
TargetInterleukin-1 receptor-associated kinase 4(Homo sapiens (Human))
Genentech
Curated by ChEMBL
LigandPNGBDBM50514938(CHEMBL4584820 | US10988478, Example 60)
Affinity DataKi:  6.60nM. Assay description: Kinase activities were assayed using the Transcreener-Fluorecescence polarization platform (BelBrook Labs, Madison, Wis., USA) that measures amounts ...
Ligand InfoPC cidPC sid
In DepthDetails US Patent
TargetInterleukin-1 receptor-associated kinase 4(Homo sapiens (Human))
Genentech
Curated by ChEMBL
LigandPNGBDBM50514938(CHEMBL4584820 | US10988478, Example 60)
Affinity DataIC50:  97nM. Assay description: Inhibition of IRAK4 in human THP1-Xblue-MD2-CD14 cells assessed as reduction in LPS-induced NFkappaB transcription by measuring alkaline phosphatase ...
Ligand InfoPC cidPC sid
In DepthDetails ArticlePubMed