BDBM50515492 60231/4::Banzel::CGP 33101::CGP-33101::E-2080::E2080::Inovelon::RUF 331::RUF-331::Rufinamide
SMILES NC(=O)c1cn(Cc2c(F)cccc2F)nn1
InChI Key InChIKey=POGQSBRIGCQNEG-UHFFFAOYSA-N
Data  3 KI
  Tab Delimited (TSV)   2D SDfile   Computed 3D by Vconf -m prep SDfile
Find this compound or compounds like it in BindingDB:
Activity Spreadsheet -- Enzyme Inhibition Constant Data from BindingDB
Found 3 hits for monomerid = 50515492
TargetCarbonic anhydrase 5A, mitochondrial(Homo sapiens (Human))
"Magna Gr£Cia" University Of Catanzaro
Curated by ChEMBL
LigandPNGBDBM50515492(60231/4 | Banzel | CGP 33101 | CGP-33101 | E-2080 ...)
Affinity DataKi:  344nM. Assay description: Inhibition of recombinant human carbonic anhydrase VA preincubated with enzyme for 15 mins by phenol red dye based stopped flow CO2 hydration assay
In DepthDetails ArticlePubMed
TargetCarbonic anhydrase 1(Homo sapiens (Human))
"Magna Gr£Cia" University Of Catanzaro
Curated by ChEMBL
LigandPNGBDBM50515492(60231/4 | Banzel | CGP 33101 | CGP-33101 | E-2080 ...)
Affinity DataKi: >1.00E+4nM. Assay description: Inhibition of recombinant human carbonic anhydrase 1 preincubated with enzyme for 15 mins by phenol red dye based stopped flow CO2 hydration assay
In DepthDetails ArticlePubMed
TargetCarbonic anhydrase 2(Homo sapiens (Human))
"Magna Gr£Cia" University Of Catanzaro
Curated by ChEMBL
LigandPNGBDBM50515492(60231/4 | Banzel | CGP 33101 | CGP-33101 | E-2080 ...)
Affinity DataKi: >1.00E+4nM. Assay description: Inhibition of recombinant human carbonic anhydrase 2 preincubated with enzyme for 15 mins by phenol red dye based stopped flow CO2 hydration assay
In DepthDetails ArticlePubMed