BDBM50515874 CHEMBL4550339
SMILES CC(=O)OCCNC(=O)[C@H]1CC(=O)N([C@@H]1c1ccc(Cl)cc1)c1ccc(cc1)S(N)(=O)=O
InChI Key InChIKey=OPUSYVWGYWIQQV-AZUAARDMSA-N
Data  4 KI
  Tab Delimited (TSV)   2D SDfile   Computed 3D by Vconf -m prep SDfile
Find this compound or compounds like it in BindingDB:
Activity Spreadsheet -- Enzyme Inhibition Constant Data from BindingDB
Found 4 hits for monomerid = 50515874
TargetCarbonic anhydrase 4(Homo sapiens (Human))
Saint Petersburg State University
Curated by ChEMBL
LigandPNGBDBM50515874(CHEMBL4550339)
Affinity DataKi:  0.590nM. Assay description: Inhibition of human recombinant carbonic anhydrase 4 preincubated for 15 mins by phenol red dye based stopped flow CO2 hydration assay
Ligand InfoPC cidPC sid
In DepthDetails ArticlePubMed
TargetCarbonic anhydrase 2(Homo sapiens (Human))
Saint Petersburg State University
Curated by ChEMBL
LigandPNGBDBM50515874(CHEMBL4550339)
Affinity DataKi:  13nM. Assay description: Inhibition of human recombinant carbonic anhydrase 2 preincubated for 15 mins by phenol red dye based stopped flow CO2 hydration assay
Ligand InfoPC cidPC sid
In DepthDetails ArticlePubMed
TargetCarbonic anhydrase 7(Homo sapiens (Human))
Saint Petersburg State University
Curated by ChEMBL
LigandPNGBDBM50515874(CHEMBL4550339)
Affinity DataKi:  47nM. Assay description: Inhibition of human recombinant carbonic anhydrase 7 preincubated for 15 mins by phenol red dye based stopped flow CO2 hydration assay
Ligand InfoPC cidPC sid
In DepthDetails ArticlePubMed
TargetCarbonic anhydrase 1(Homo sapiens (Human))
Saint Petersburg State University
Curated by ChEMBL
LigandPNGBDBM50515874(CHEMBL4550339)
Affinity DataKi:  1.07E+3nM. Assay description: Inhibition of human recombinant carbonic anhydrase 1 preincubated for 15 mins by phenol red dye based stopped flow CO2 hydration assay
Ligand InfoPC cidPC sid
In DepthDetails ArticlePubMed