BDBM50516347 CHEMBL4531593
SMILES Cc1nc2cc(C)c(CN(C#C)c3ccc(C(=O)N[C@@H](CCc4nnnn4CC(O)=O)C(O)=O)c(F)c3)cc2c(=O)[nH]1
InChI Key InChIKey=IQAMWMQVSMLMHU-NRFANRHFSA-N
Data  1 IC50
  Tab Delimited (TSV)   2D SDfile   Computed 3D by Vconf -m prep SDfile
Find this compound or compounds like it in BindingDB:
Activity Spreadsheet -- Enzyme Inhibition Constant Data from BindingDB
Found 1 hit for monomerid = 50516347
TargetPolyunsaturated fatty acid lipoxygenase ALOX15B(Rattus norvegicus)
Henan University Of Chinese Medicine
Curated by ChEMBL
LigandPNGBDBM50516347(CHEMBL4531593)
Affinity DataIC50:  2.40nM. Assay description: Inhibition of thymidylate synthase (unknown origin)
Ligand InfoPC cidPC sid
In DepthDetails ArticlePubMed