BDBM505169 US11066409, Compound I-0027
SMILES COc1cc(Nc2nc(=O)cc3CCC(c4ccccc4)n23)c(C)cc1Cl
InChI Key InChIKey=IGXXZALSMSNQNE-UHFFFAOYSA-N
Data  1 IC50
  Tab Delimited (TSV)   2D SDfile   Computed 3D by Vconf -m prep SDfile
Find this compound or compounds like it in BindingDB:
Activity Spreadsheet -- Enzyme Inhibition Constant Data from BindingDB
Found 1 hit for monomerid = 505169
TargetP2X purinoceptor 7(Homo sapiens (Human))
Shionogi
US Patent
LigandPNGBDBM505169(US11066409, Compound I-0027)
Affinity DataIC50: <10nM. Assay description: Evaluation of a human P2X7 receptor inhibitory activity Stably expressing cell line (1321N1 cell transfected with the human P2X7 receptor gene (GenBa...
Ligand InfoPC cidPC sid
In DepthDetails US Patent