BDBM50517060 CHEMBL4560160
SMILES CC1=NN(C(=O)C1C(=O)Nc1cccc(c1)C(C)(F)F)c1ccc(OC(F)F)cc1
InChI Key InChIKey=RKHTWHXFUQTRLX-UHFFFAOYSA-N
Data  1 IC50
  Tab Delimited (TSV)   2D SDfile   Computed 3D by Vconf -m prep SDfile
Find this compound or compounds like it in BindingDB:
Activity Spreadsheet -- Enzyme Inhibition Constant Data from BindingDB
Found 1 hit for monomerid = 50517060
TargetAcetyl-coenzyme A synthetase, cytoplasmic(Homo sapiens)
Usona Institute
Curated by ChEMBL
LigandPNGBDBM50517060(CHEMBL4560160)
Affinity DataIC50:  2.70nM. Assay description: Inhibition of ACSS2 in human MDA-MB-468 cells assessed as 13C-acetate incorporation incubated for 5 hrs measured under hypoxic conditions by LCMS ana...
Ligand InfoPC cidPC sid
In DepthDetails ArticlePubMed