BDBM50518891 CHEMBL4460127
SMILES C[C@H](CS)C(=O)N[C@H](Cc1coc2ccccc12)B(O)O
InChI Key InChIKey=RHFFZKGRUWBIGC-NOZJJQNGSA-N
Data  1 KI
PDB links: 1 PDB ID matches this monomer.
  Tab Delimited (TSV)   2D SDfile   Computed 3D by Vconf -m prep SDfile
Find this compound or compounds like it in BindingDB:
Activity Spreadsheet -- Enzyme Inhibition Constant Data from BindingDB
Found 1 hit for monomerid = 50518891
TargetBeta-lactamase TEM(Escherichia coli)
Sichuan University
Curated by ChEMBL
LigandPNGBDBM50518891(CHEMBL4460127)
Affinity DataKi:  3.27E+4nM. Assay description: Inhibition of bacterial N-terminal His-tagged TEV protease site linked TEM-1 (24 to 286 amino acids) expressed in Escherichia coli Transetta (DE3) pr...
Ligand InfoPC cidPC sidPDB
In DepthDetails ArticlePubMed