BDBM505207 US11066409, Compound I-0067
SMILES Cc1cc2COCc2cc1Nc1nc(=O)cc2CCC(c3ccc(F)cc3)n12
InChI Key InChIKey=WJSSLKCIWQRWQK-UHFFFAOYSA-N
Data  1 IC50
  Tab Delimited (TSV)   2D SDfile   Computed 3D by Vconf -m prep SDfile
Find this compound or compounds like it in BindingDB:
Activity Spreadsheet -- Enzyme Inhibition Constant Data from BindingDB
Found 1 hit for monomerid = 505207
TargetP2X purinoceptor 7(Homo sapiens (Human))
Shionogi
US Patent
LigandPNGBDBM505207(US11066409, Compound I-0067)
Affinity DataIC50: <10nM. Assay description: Evaluation of a human P2X7 receptor inhibitory activity Stably expressing cell line (1321N1 cell transfected with the human P2X7 receptor gene (GenBa...
Ligand InfoPC cidPC sid
In DepthDetails US Patent