BDBM50521421 CHEMBL4514045
SMILES COc1cc(cc(OC)c1O)-c1nc(C(C)C)c([nH]1)C(C)C
InChI Key InChIKey=MZENOGRXPMFXGL-UHFFFAOYSA-N
Data  1 IC50
  Tab Delimited (TSV)   2D SDfile   Computed 3D by Vconf -m prep SDfile
Find this compound or compounds like it in BindingDB:
Activity Spreadsheet -- Enzyme Inhibition Constant Data from BindingDB
Found 1 hit for monomerid = 50521421
TargetSphingomyelin phosphodiesterase 3(Homo sapiens)
Johns Hopkins University
Curated by ChEMBL
LigandPNGBDBM50521421(CHEMBL4514045)
Affinity DataIC50:  90nM. Assay description: Inhibition of human recombinant nSMase expressed in HEK293 cells using sphingomyelin as substrate by alkaline phosphatase, choline oxidase and horser...
Ligand InfoPC cidPC sid
In DepthDetails ArticlePubMed