BDBM50523342 CHEMBL4527427
SMILES Cc1nn(-c2ccc(cc2)S(N)(=O)=O)c(=O)c2ccccc12
InChI Key InChIKey=PWDQQZDAXPXYEM-UHFFFAOYSA-N
Data  4 KI
  Tab Delimited (TSV)   2D SDfile   Computed 3D by Vconf -m prep SDfile
Find this compound or compounds like it in BindingDB:
Activity Spreadsheet -- Enzyme Inhibition Constant Data from BindingDB
Found 4 hits for monomerid = 50523342
TargetCarbonic anhydrase 2(Homo sapiens (Human))
Saint Petersburg State University
Curated by ChEMBL
LigandPNGBDBM50523342(CHEMBL4527427)
Affinity DataKi:  0.0300nM. Assay description: Inhibition of human cytosolic CA 2 preincubated for 15 mins by phenol red dye-based stopped-flow CO2 hydration assay
Ligand InfoPC cidPC sid
In DepthDetails ArticlePubMed
TargetCarbonic anhydrase 9(Homo sapiens (Human))
Saint Petersburg State University
Curated by ChEMBL
LigandPNGBDBM50523342(CHEMBL4527427)
Affinity DataKi:  0.240nM. Assay description: Inhibition of membrane bound human CA 9 preincubated for 15 mins by phenol red dye-based stopped-flow CO2 hydration assay
Ligand InfoPC cidPC sid
In DepthDetails ArticlePubMed
TargetCarbonic anhydrase 12(Homo sapiens (Human))
Saint Petersburg State University
Curated by ChEMBL
LigandPNGBDBM50523342(CHEMBL4527427)
Affinity DataKi:  9nM. Assay description: Inhibition of membrane bound human CA 12 preincubated for 15 mins by phenol red dye-based stopped-flow CO2 hydration assay
Ligand InfoPC cidPC sid
In DepthDetails ArticlePubMed
TargetCarbonic anhydrase 1(Homo sapiens (Human))
Saint Petersburg State University
Curated by ChEMBL
LigandPNGBDBM50523342(CHEMBL4527427)
Affinity DataKi:  90nM. Assay description: Inhibition of human cytosolic CA 1 preincubated for 15 mins by phenol red dye-based stopped-flow CO2 hydration assay
Ligand InfoPC cidPC sid
In DepthDetails ArticlePubMed