BDBM50523638 CHEMBL4470815::US10709709, Example 200
SMILES Cc1ncnc2n(ccc12)[C@@H]1C[C@H](Oc2cc(OC(F)F)c(F)c3CCNCc23)[C@@H](O)[C@H]1O
InChI Key InChIKey=PJEJAJGWAXXONO-PEFDPPPMSA-N
Data  2 IC50
  Tab Delimited (TSV)   2D SDfile   Computed 3D by Vconf -m prep SDfile
Find this compound or compounds like it in BindingDB:
Activity Spreadsheet -- Enzyme Inhibition Constant Data from BindingDB
Found 2 hits for monomerid = 50523638
TargetProtein arginine N-methyltransferase 5(Homo sapiens (Human))
Prelude Therapeutics
Curated by ChEMBL
LigandPNGBDBM50523638(CHEMBL4470815 | US10709709, Example 200)
Affinity DataIC50:  1nM. Assay description: Inhibition of PRMT5 (unknown origin)
Ligand InfoPC cidPC sid
In DepthDetails ArticlePubMed
TargetProtein arginine N-methyltransferase 5(Homo sapiens (Human))
Prelude Therapeutics
Curated by ChEMBL
LigandPNGBDBM50523638(CHEMBL4470815 | US10709709, Example 200)
Affinity DataIC50:  1nM. Assay description: Compounds were solubilized in DMSO and serially diluted, using 3-fold dilutions, into 100% DMSO at a concentration 50-fold greater than the desired a...
Ligand InfoPC cidPC sid
In DepthDetails US Patent